{"text_format":"1","workbook":"xlsx","n_sheets":12,"sheets":["Select an authority","CP conferences","CP registrations","CP on Register","CP de-registrations","DATA CP CON","DATA CP REG","DATA CP ON REG","DATA CP DEREG","REF EA Name","REF CAS2","REF CAs"],"not_rendered":{"charts":4,"images":0,"macros":1,"external_links":0,"defined_names":4,"comments":0,"pivot_tables":0},"unopened":[],"bounds":{"document_bytes":16777216,"sheet_cells":100000,"rows_first":2000,"rows_last":500,"rows_between":2000,"halvings":0,"cell_chars":16384,"cell_head_chars":4096},"cells_cut":0,"cells_raw":0,"read":"whole","date_system":"1900"}

{"sheet":"Select an authority","index":0,"n_rows":24,"n_cols":5,"rows_kept":24,"cut":false,"hidden":false,"merged":[]}
[7]
["Selecting an Authority and its Standard Comparator Authorities"]
["PLEASE REMEMBER TO 'ENABLE MACROS' - ",null,null,null,"Please select a Local Authority:"]
["THEY MAY HAVE BEEN DISABLED."]
["Last updated: 23/05/2023"]
["Child Protection publications can be found at:"]
["Children's Social Work Statistics"]
["To help comparisons between local authorities, we have used the comparators as calculated by HMIE in 2003.  "]
["These were determined by comparing a number of statistical measures between education authorities, such as unemployment rates, looked after children rates, % owner-occupied properties etc.  In order to determine the weight that can be given to comparisons between the local authority and its group, a star rating was introduced which indicates the ‘closeness’ of a particular authority to each member; five stars indicating extremely close and one star indicating not close:"]
["*****","Extremely Close"]
{"$rows_left_out":15}
{"sheet":"CP conferences","index":1,"n_rows":47,"n_cols":29,"rows_kept":47,"cut":false,"hidden":false,"merged":[]}
[{"$f":"'DATA CP CON'!A1","v":"Child Protection: Case conferences: 31 July 2016-2022"}]
[null,"select comparators:"]
[{"$f":"M3","v":3},{"$f":"J3","v":0},null,null,null,null,null,null,null,null,null,null,{"$f":"VLOOKUP('Select an authority'!$A$1,'REF CAs'!$A$1:$F$32,2,0)","v":3}]
[{"$f":"M4","v":16},33,null,null,null,null,null,null,null,null,null,null,{"$f":"VLOOKUP('Select an authority'!$A$1,'REF CAs'!$A$1:$F$32,3,0)","v":16}]
[{"$f":"M5","v":4},33,null,null,null,null,null,null,null,null,null,null,{"$f":"VLOOKUP('Select an authority'!$A$1,'REF CAs'!$A$1:$F$32,4,0)","v":4}]
[10,33,null,null,null,null,null,null,null,null,null,null,{"$f":"VLOOKUP('Select an authority'!$A$1,'REF CAs'!$A$1:$F$32,5,0)","v":26}]
[{"$f":"M7","v":19},33,null,null,null,null,null,null,null,null,null,null,{"$f":"VLOOKUP('Select an authority'!$A$1,'REF CAs'!$A$1:$F$32,6,0)","v":19}]
[{"$f":"M8","v":0}]
[]
[]
{"$rows_left_out":38}
{"sheet":"CP registrations","index":2,"n_rows":47,"n_cols":29,"rows_kept":47,"cut":false,"hidden":false,"merged":[]}
[{"$f":"'DATA CP REG'!A1","v":"Child Protection: Registrations: 31 July 2016-2022"}]
[null,"select comparators:"]
[{"$f":"J3","v":3},null,null,null,null,null,null,null,null,{"$f":"VLOOKUP('Select an authority'!$A$1,'REF CAs'!$A$1:$F$32,2,0)","v":3}]
[{"$f":"J4","v":16},null,null,null,null,null,null,null,null,{"$f":"VLOOKUP('Select an authority'!$A$1,'REF CAs'!$A$1:$F$32,3,0)","v":16}]
[{"$f":"J5","v":4},null,null,null,null,null,null,null,null,{"$f":"VLOOKUP('Select an authority'!$A$1,'REF CAs'!$A$1:$F$32,4,0)","v":4}]
[{"$f":"J6","v":26},null,null,null,null,null,null,null,null,{"$f":"VLOOKUP('Select an authority'!$A$1,'REF CAs'!$A$1:$F$32,5,0)","v":26}]
[{"$f":"J7","v":19},null,null,null,null,null,null,null,null,{"$f":"VLOOKUP('Select an authority'!$A$1,'REF CAs'!$A$1:$F$32,6,0)","v":19}]
[]
[]
[]
{"$rows_left_out":38}
{"sheet":"CP on Register","index":3,"n_rows":47,"n_cols":29,"rows_kept":47,"cut":false,"hidden":false,"merged":[]}
[{"$f":"'DATA CP ON REG'!A1","v":"Child Protection: On Child Protection Register:  as at 31 July 2016-2022"}]
[null,"select comparators:"]
[{"$f":"N3","v":3},null,null,null,null,null,null,null,null,null,null,null,null,{"$f":"VLOOKUP('Select an authority'!$A$1,'REF CAs'!$A$1:$F$32,2,0)","v":3}]
[{"$f":"N4","v":16},null,null,null,null,null,null,null,null,null,null,null,null,{"$f":"VLOOKUP('Select an authority'!$A$1,'REF CAs'!$A$1:$F$32,3,0)","v":16}]
[{"$f":"N5","v":4},null,null,null,null,null,null,null,null,null,null,null,null,{"$f":"VLOOKUP('Select an authority'!$A$1,'REF CAs'!$A$1:$F$32,4,0)","v":4}]
[{"$f":"N6","v":26},null,null,null,null,null,null,null,null,null,null,null,null,{"$f":"VLOOKUP('Select an authority'!$A$1,'REF CAs'!$A$1:$F$32,5,0)","v":26}]
[{"$f":"N7","v":19},null,null,null,null,null,null,null,null,null,null,null,null,{"$f":"VLOOKUP('Select an authority'!$A$1,'REF CAs'!$A$1:$F$32,6,0)","v":19}]
[]
[]
[]
{"$rows_left_out":38}
{"sheet":"CP de-registrations","index":4,"n_rows":48,"n_cols":29,"rows_kept":48,"cut":false,"hidden":false,"merged":[]}
[{"$f":"'DATA CP DEREG'!A1","v":"Child Protection: De-registrations: 31 July 2016-2022"}]
[]
[11,null,null,null,{"$f":"VLOOKUP('Select an authority'!$A$1,'REF CAs'!$A$1:$F$32,2,0)","v":3},null,null,null,{"$f":"VLOOKUP('Select an authority'!$A$1,'REF CAs'!$A$1:$F$32,2,0)","v":3}]
[12,null,null,null,{"$f":"VLOOKUP('Select an authority'!$A$1,'REF CAs'!$A$1:$F$32,3,0)","v":16},null,null,null,{"$f":"VLOOKUP('Select an authority'!$A$1,'REF CAs'!$A$1:$F$32,3,0)","v":16}]
[28,null,null,null,{"$f":"VLOOKUP('Select an authority'!$A$1,'REF CAs'!$A$1:$F$32,4,0)","v":4},null,null,null,{"$f":"VLOOKUP('Select an authority'!$A$1,'REF CAs'!$A$1:$F$32,4,0)","v":4}]
[7,null,null,null,{"$f":"VLOOKUP('Select an authority'!$A$1,'REF CAs'!$A$1:$F$32,5,0)","v":26},null,null,null,{"$f":"VLOOKUP('Select an authority'!$A$1,'REF CAs'!$A$1:$F$32,5,0)","v":26}]
[20,null,null,null,{"$f":"VLOOKUP('Select an authority'!$A$1,'REF CAs'!$A$1:$F$32,6,0)","v":19},null,null,null,{"$f":"VLOOKUP('Select an authority'!$A$1,'REF CAs'!$A$1:$F$32,6,0)","v":19}]
[]
[]
[]
{"$rows_left_out":39}
{"sheet":"DATA CP CON","index":5,"n_rows":41,"n_cols":25,"rows_kept":41,"cut":false,"hidden":true,"merged":[]}
["Child Protection: Case conferences: 31 July 2016-2022"]
["Number of child protection case conferences: 31 July 2016-2022",null,null,null,null,null,null,null,null,"Population Aged 0-15",null,null,null,null,null,null,null,"Number of child protection referrals that resulted in a case conference per 1,000 children: year ended 31 July 2016-2022"]
["Council",2016,2017,2018,2019,2020,2021,2022,null,2016,2017,2018,2019,2020,2021,2022,null,"Council",{"$f":"B3","v":2016},{"$f":"C3","v":2017},2018,2019,2020,2021,2022]
["Aberdeen City",196,205,176,208,195,160,175,null,34187,34495,34833,35423,35789,35860,35860,null,"Aberdeen City",{"$f":"IFERROR(B4*1000/J4,\"*\")","v":5.7331734284962117},{"$f":"IFERROR(C4*1000/K4,\"*\")","v":5.9428902739527469},{"$f":"IFERROR(D4*1000/L4,\"*\")","v":5.0526799299514824},{"$f":"IFERROR(E4*1000/M4,\"*\")","v":5.8718911441718653},{"$f":"IFERROR(F4*1000/N4,\"*\")","v":5.448601525608427},{"$f":"IFERROR(G4*1000/O4,\"*\")","v":4.4617958728388176},{"$f":"IFERROR(H4*1000/P4,\"*\")","v":4.880089235917457}]
["Aberdeenshire",117,134,127,154,165,117,126,null,48871,48888,49033,49016,48674,48578,48578,null,"Aberdeenshire",2.3940578257044054,2.7409589265259369,2.5900923867599372,3.141831238779174,3.3899001520318857,2.4084976738441268,2.5937667256782904]
["Angus",181,171,202,143,130,111,98,null,19445,19288,19253,19145,18908,18639,18639,null,"Angus",9.3083054769863711,8.8656159270012438,10.491871396665454,7.4693131365891876,6.8753966574994712,5.955255110252696,5.257792800042921]
["Argyll & Bute",73,92,80,68,75,54,38,null,13238,13163,13024,12906,12577,12441,12441,null,"Argyll & Bute",5.5144281613536785,6.9892881561953963,6.1425061425061429,5.268867193553386,5.9632662797169438,4.3404870991077891,3.054416847520296]
["City of Edinburgh",482,368,312,201,199,200,175,null,77364,78052,78501,79067,79150,78826,78826,null,"City of Edinburgh",6.2302879892456442,4.7148055142725367,3.9744716627813657,2.5421477987023664,2.5142135186355024,2.537233907593941,2.2200796691446985]
["Clackmannanshire",26,59,76,71,111,100,37,null,9024,9020,8980,8946,8897,8877,8877,null,"Clackmannanshire",2.8812056737588652,6.541019955654102,8.4632516703786198,7.9365079365079367,12.476115544565584,11.265067027148811,4.1680748000450603]
["Dumfries and Galloway",149,227,284,209,69,93,90,null,23614,23487,23424,23243,23050,22882,22882,null,"Dumfries and Galloway",6.3098162107224525,9.6649210201388005,12.12431693989071,8.9919545669663989,2.9934924078091107,4.0643300410803249,3.9332226204003145]
{"$rows_left_out":32}
{"sheet":"DATA CP REG","index":6,"n_rows":41,"n_cols":25,"rows_kept":41,"cut":false,"hidden":true,"merged":[]}
["Child Protection: Registrations: 31 July 2016-2022"]
["Number of registrations following a case conference: 31 July 2016-2022",null,null,null,null,null,null,null,null,"Population Aged 0-15",null,null,null,null,null,null,null,"Number of registrations following a case conference per 1,000 children: 31 July 2016-2022"]
["Council",2016,2017,2018,2019,2020,2021,2022,null,{"$f":"'DATA CP CON'!J3","v":2016},{"$f":"'DATA CP CON'!K3","v":2017},{"$f":"'DATA CP CON'!L3","v":2018},{"$f":"'DATA CP CON'!M3","v":2019},{"$f":"'DATA CP CON'!N3","v":2020},{"$f":"'DATA CP CON'!O3","v":2021},{"$f":"'DATA CP CON'!P3","v":2022},null,"Council",{"$f":"'DATA CP CON'!S3","v":2016},{"$f":"'DATA CP CON'!T3","v":2017},{"$f":"'DATA CP CON'!U3","v":2018},{"$f":"'DATA CP CON'!V3","v":2019},{"$f":"'DATA CP CON'!W3","v":2020},{"$f":"'DATA CP CON'!X3","v":2021},{"$f":"'DATA CP CON'!Y3","v":2022}]
["Aberdeen City",156,164,150,162,168,141,156,null,{"$f":"'DATA CP CON'!J4","v":34187},{"$f":"'DATA CP CON'!K4","v":34495},{"$f":"'DATA CP CON'!L4","v":34833},{"$f":"'DATA CP CON'!M4","v":35423},{"$f":"'DATA CP CON'!N4","v":35789},{"$f":"'DATA CP CON'!O4","v":35860},{"$f":"'DATA CP CON'!P4","v":35860},null,"Aberdeen City",{"$f":"IFERROR(B4*1000/J4,\"*\")","v":4.5631380349255561},{"$f":"IFERROR(C4*1000/K4,\"*\")","v":4.7543122191621974},{"$f":"IFERROR(D4*1000/L4,\"*\")","v":4.3062613039359228},{"$f":"IFERROR(E4*1000/M4,\"*\")","v":4.5732998334415491},{"$f":"IFERROR(F4*1000/N4,\"*\")","v":4.6941797759087986},{"$f":"IFERROR(G4*1000/O4,\"*\")","v":3.931957612939208},{"$f":"IFERROR(H4*1000/P4,\"*\")","v":4.3502509760178469}]
["Aberdeenshire",109,124,116,142,154,107,120,null,{"$f":"'DATA CP CON'!J5","v":48871},{"$f":"'DATA CP CON'!K5","v":48888},{"$f":"'DATA CP CON'!L5","v":49033},{"$f":"'DATA CP CON'!M5","v":49016},{"$f":"'DATA CP CON'!N5","v":48674},{"$f":"'DATA CP CON'!O5","v":48578},{"$f":"'DATA CP CON'!P5","v":48578},null,"Aberdeenshire",2.2303615641177794,2.5364097529045981,2.3657536760956908,2.8970132201730046,3.1639068085630933,2.2026431718061672,2.4702540244555147]
["Angus",151,126,154,98,108,95,94,null,{"$f":"'DATA CP CON'!J6","v":19445},{"$f":"'DATA CP CON'!K6","v":19288},{"$f":"'DATA CP CON'!L6","v":19253},{"$f":"'DATA CP CON'!M6","v":19145},{"$f":"'DATA CP CON'!N6","v":18908},{"$f":"'DATA CP CON'!O6","v":18639},{"$f":"'DATA CP CON'!P6","v":18639},null,"Angus",7.7654924145024431,6.5325591041061797,7.9987534410221786,5.1188299817184646,5.7118679923841764,5.0968399592252807,5.0431890122860672]
["Argyll & Bute",64,73,57,56,67,48,30,null,{"$f":"'DATA CP CON'!J7","v":13238},{"$f":"'DATA CP CON'!K7","v":13163},{"$f":"'DATA CP CON'!L7","v":13024},{"$f":"'DATA CP CON'!M7","v":12906},{"$f":"'DATA CP CON'!N7","v":12577},{"$f":"'DATA CP CON'!O7","v":12441},{"$f":"'DATA CP CON'!P7","v":12441},null,"Argyll & Bute",4.8345671551593901,5.5458482108941727,4.3765356265356266,4.3390671005733763,5.3271845432138027,3.8582107547624789,2.4113817217265492]
["City of Edinburgh",411,302,285,180,178,166,162,null,{"$f":"'DATA CP CON'!J8","v":77364},{"$f":"'DATA CP CON'!K8","v":78052},{"$f":"'DATA CP CON'!L8","v":78501},{"$f":"'DATA CP CON'!M8","v":79067},{"$f":"'DATA CP CON'!N8","v":79150},{"$f":"'DATA CP CON'!O8","v":78826},{"$f":"'DATA CP CON'!P8","v":78826},null,"City of Edinburgh",5.3125484721575926,3.8692153948649617,3.6305269996560554,2.2765502674946565,2.2488945041061275,2.105904143302971,2.0551594651510925]
["Clackmannanshire",25,46,58,58,73,80,30,null,{"$f":"'DATA CP CON'!J9","v":9024},{"$f":"'DATA CP CON'!K9","v":9020},{"$f":"'DATA CP CON'!L9","v":8980},{"$f":"'DATA CP CON'!M9","v":8946},{"$f":"'DATA CP CON'!N9","v":8897},{"$f":"'DATA CP CON'!O9","v":8877},{"$f":"'DATA CP CON'!P9","v":8877},null,"Clackmannanshire",2.770390070921986,5.0997782705099777,6.4587973273942092,6.4833445115135255,8.2050129257052937,9.0120536217190494,3.3795201081446433]
["Dumfries and Galloway",109,156,191,142,42,61,79,null,{"$f":"'DATA CP CON'!J10","v":23614},{"$f":"'DATA CP CON'!K10","v":23487},{"$f":"'DATA CP CON'!L10","v":23424},{"$f":"'DATA CP CON'!M10","v":23243},{"$f":"'DATA CP CON'!N10","v":23050},{"$f":"'DATA CP CON'!O10","v":22882},{"$f":"'DATA CP CON'!P10","v":22882},null,"Dumfries and Galloway",4.6159058185821973,6.6419721548090429,8.1540300546448083,6.1093662608097059,1.8221258134490239,2.6658508871602131,3.4524954112402764]
{"$rows_left_out":32}
{"sheet":"DATA CP ON REG","index":7,"n_rows":41,"n_cols":25,"rows_kept":41,"cut":false,"hidden":true,"merged":[]}
["Child Protection: On Child Protection Register:  as at 31 July 2016-2022"]
["Number of children on child protection registers: as at 31 July 2016-2022",null,null,null,null,null,null,null,null,"Population Aged 0-15",null,null,null,null,null,null,null,"Number of children on child protection registers per 1,000 children: as at 31 July 2016-2022"]
["Council",2016,2017,2018,2019,2020,2021,2022,null,{"$f":"'DATA CP CON'!J3","v":2016},{"$f":"'DATA CP CON'!K3","v":2017},{"$f":"'DATA CP CON'!L3","v":2018},{"$f":"'DATA CP CON'!M3","v":2019},{"$f":"'DATA CP CON'!N3","v":2020},{"$f":"'DATA CP CON'!O3","v":2021},{"$f":"'DATA CP CON'!P3","v":2022},null,"Council",2016,2017,2018,2019,2020,2021,2022]
["Aberdeen City",118,80,68,119,142,83,115,null,{"$f":"'DATA CP CON'!J4","v":34187},{"$f":"'DATA CP CON'!K4","v":34495},{"$f":"'DATA CP CON'!L4","v":34833},{"$f":"'DATA CP CON'!M4","v":35423},{"$f":"'DATA CP CON'!N4","v":35789},{"$f":"'DATA CP CON'!O4","v":35860},{"$f":"'DATA CP CON'!P4","v":35860},null,"Aberdeen City",{"$f":"IFERROR(B4*1000/J4,\"*\")","v":3.4516044110334336},{"$f":"IFERROR(C4*1000/K4,\"*\")","v":2.3191766922742425},{"$f":"IFERROR(D4*1000/L4,\"*\")","v":1.9521717911176184},{"$f":"IFERROR(E4*1000/M4,\"*\")","v":3.359399260367558},{"$f":"IFERROR(F4*1000/N4,\"*\")","v":3.9676995724943418},{"$f":"IFERROR(G4*1000/O4,\"*\")","v":2.3145566090351366},{"$f":"IFERROR(H4*1000/P4,\"*\")","v":3.2069157836029003}]
["Aberdeenshire",64,77,77,103,111,73,89,null,{"$f":"'DATA CP CON'!J5","v":48871},{"$f":"'DATA CP CON'!K5","v":48888},{"$f":"'DATA CP CON'!L5","v":49033},{"$f":"'DATA CP CON'!M5","v":49016},{"$f":"'DATA CP CON'!N5","v":48674},{"$f":"'DATA CP CON'!O5","v":48578},{"$f":"'DATA CP CON'!P5","v":48578},null,"Aberdeenshire",1.3095700926930081,1.5750286368843069,1.5703709746497256,2.1013546597029542,2.2804782840941775,1.5027378648771048,1.8321050681378401]
["Angus",96,51,64,45,35,45,59,null,{"$f":"'DATA CP CON'!J6","v":19445},{"$f":"'DATA CP CON'!K6","v":19288},{"$f":"'DATA CP CON'!L6","v":19253},{"$f":"'DATA CP CON'!M6","v":19145},{"$f":"'DATA CP CON'!N6","v":18908},{"$f":"'DATA CP CON'!O6","v":18639},{"$f":"'DATA CP CON'!P6","v":18639},null,"Angus",4.9370017999485727,2.6441310659477395,3.3241572741910352,2.3504831548707235,1.8510683308652423,2.4142926122646067,3.1654058694135951]
["Argyll and Bute",40,31,31,28,49,32,21,null,{"$f":"'DATA CP CON'!J7","v":13238},{"$f":"'DATA CP CON'!K7","v":13163},{"$f":"'DATA CP CON'!L7","v":13024},{"$f":"'DATA CP CON'!M7","v":12906},{"$f":"'DATA CP CON'!N7","v":12577},{"$f":"'DATA CP CON'!O7","v":12441},{"$f":"'DATA CP CON'!P7","v":12441},null,"Argyll & Bute",3.0216044719746185,2.3550862265441008,2.38022113022113,2.1695335502866882,3.8960006360817365,2.5721405031749858,1.6879672052085846]
["City of Edinburgh",287,235,189,122,95,97,104,null,{"$f":"'DATA CP CON'!J8","v":77364},{"$f":"'DATA CP CON'!K8","v":78052},{"$f":"'DATA CP CON'!L8","v":78501},{"$f":"'DATA CP CON'!M8","v":79067},{"$f":"'DATA CP CON'!N8","v":79150},{"$f":"'DATA CP CON'!O8","v":78826},{"$f":"'DATA CP CON'!P8","v":78826},null,"City of Edinburgh",3.709735794426348,3.0108133039512119,2.4076126418771735,1.5429951813019338,1.2002526847757422,1.2305584451830613,1.3193616319488493]
["Clackmannanshire",18,26,37,24,43,41,15,null,{"$f":"'DATA CP CON'!J9","v":9024},{"$f":"'DATA CP CON'!K9","v":9020},{"$f":"'DATA CP CON'!L9","v":8980},{"$f":"'DATA CP CON'!M9","v":8946},{"$f":"'DATA CP CON'!N9","v":8897},{"$f":"'DATA CP CON'!O9","v":8877},{"$f":"'DATA CP CON'!P9","v":8877},null,"Clackmannanshire",1.9946808510638299,2.8824833702882482,4.1202672605790642,2.6827632461435278,4.8330898055524338,4.6186774811310123,1.6897600540723217]
["Dumfries and Galloway",61,78,93,18,26,34,41,null,{"$f":"'DATA CP CON'!J10","v":23614},{"$f":"'DATA CP CON'!K10","v":23487},{"$f":"'DATA CP CON'!L10","v":23424},{"$f":"'DATA CP CON'!M10","v":23243},{"$f":"'DATA CP CON'!N10","v":23050},{"$f":"'DATA CP CON'!O10","v":22882},{"$f":"'DATA CP CON'!P10","v":22882},null,"Dumfries and Galloway",2.5832133480138899,3.3209860774045215,3.9702868852459017,0.77442670911672329,1.1279826464208242,1.4858841010401189,1.7918014159601434]
{"$rows_left_out":32}
{"sheet":"DATA CP DEREG","index":8,"n_rows":41,"n_cols":25,"rows_kept":41,"cut":false,"hidden":true,"merged":[]}
["Child Protection: De-registrations: 31 July 2016-2022"]
["Number of de-registrations: 31 July 2016-2022",null,null,null,null,null,null,null,null,"Population Aged 0-15",null,null,null,null,null,null,null,"Number of de-registrations per 1,000 children: 31 July 2016-2022"]
["Council",2016,2017,2018,2019,2020,2021,2022,null,{"$f":"'DATA CP CON'!J3","v":2016},{"$f":"'DATA CP CON'!K3","v":2017},{"$f":"'DATA CP CON'!L3","v":2018},{"$f":"'DATA CP CON'!M3","v":2019},{"$f":"'DATA CP CON'!N3","v":2020},{"$f":"'DATA CP CON'!O3","v":2021},{"$f":"'DATA CP CON'!P3","v":2022},null,"Council",{"$f":"B3","v":2016},2017,2018,2019,2020,2021,2022]
["Aberdeen City",136,202,162,111,145,200,124,null,{"$f":"'DATA CP CON'!J4","v":34187},{"$f":"'DATA CP CON'!K4","v":34495},{"$f":"'DATA CP CON'!L4","v":34833},{"$f":"'DATA CP CON'!M4","v":35423},{"$f":"'DATA CP CON'!N4","v":35789},{"$f":"'DATA CP CON'!O4","v":35860},{"$f":"'DATA CP CON'!P4","v":35860},null,"Aberdeen City",{"$f":"IFERROR(B4*1000/J4,\"*\")","v":3.9781203381402288},{"$f":"IFERROR(C4*1000/K4,\"*\")","v":5.8559211479924631},{"$f":"IFERROR(D4*1000/L4,\"*\")","v":4.6507622082507964},{"$f":"IFERROR(E4*1000/M4,\"*\")","v":3.1335572932840243},{"$f":"IFERROR(F4*1000/N4,\"*\")","v":4.0515242113498564},{"$f":"IFERROR(G4*1000/O4,\"*\")","v":5.5772448410485218},{"$f":"IFERROR(H4*1000/P4,\"*\")","v":3.4578918014500837}]
["Aberdeenshire",135,111,116,116,146,145,104,null,{"$f":"'DATA CP CON'!J5","v":48871},{"$f":"'DATA CP CON'!K5","v":48888},{"$f":"'DATA CP CON'!L5","v":49033},{"$f":"'DATA CP CON'!M5","v":49016},{"$f":"'DATA CP CON'!N5","v":48674},{"$f":"'DATA CP CON'!O5","v":48578},{"$f":"'DATA CP CON'!P5","v":48578},null,"Aberdeenshire",2.7623744142743138,2.2704958271968581,2.3657536760956908,2.3665741798596378,2.9995480133130625,2.984890279550414,2.1408868211947794]
["Angus",144,171,141,117,116,84,80,null,{"$f":"'DATA CP CON'!J6","v":19445},{"$f":"'DATA CP CON'!K6","v":19288},{"$f":"'DATA CP CON'!L6","v":19253},{"$f":"'DATA CP CON'!M6","v":19145},{"$f":"'DATA CP CON'!N6","v":18908},{"$f":"'DATA CP CON'!O6","v":18639},{"$f":"'DATA CP CON'!P6","v":18639},null,"Angus",7.4055026999228595,8.8656159270012438,7.3235339947021245,6.1112562026638813,6.1349693251533743,4.5066795428939317,4.2920757551370778]
["Argyll and Bute",57,82,57,59,46,65,41,null,{"$f":"'DATA CP CON'!J7","v":13238},{"$f":"'DATA CP CON'!K7","v":13163},{"$f":"'DATA CP CON'!L7","v":13024},{"$f":"'DATA CP CON'!M7","v":12906},{"$f":"'DATA CP CON'!N7","v":12577},{"$f":"'DATA CP CON'!O7","v":12441},{"$f":"'DATA CP CON'!P7","v":12441},null,"Argyll & Bute",4.3057863725638317,6.2295829218263314,4.3765356265356266,4.5715171238183787,3.657469984893059,5.2246603970741905,3.2955550196929506]
["City of Edinburgh",379,354,331,247,205,164,155,null,{"$f":"'DATA CP CON'!J8","v":77364},{"$f":"'DATA CP CON'!K8","v":78052},{"$f":"'DATA CP CON'!L8","v":78501},{"$f":"'DATA CP CON'!M8","v":79067},{"$f":"'DATA CP CON'!N8","v":79150},{"$f":"'DATA CP CON'!O8","v":78826},{"$f":"'DATA CP CON'!P8","v":78826},null,"City of Edinburgh",4.8989193940334008,4.5354379131860814,4.2165067960917693,3.1239328670621118,2.5900189513581808,2.0805318042270318,1.9663562783853044]
["Clackmannanshire",64,38,47,71,54,82,56,null,{"$f":"'DATA CP CON'!J9","v":9024},{"$f":"'DATA CP CON'!K9","v":9020},{"$f":"'DATA CP CON'!L9","v":8980},{"$f":"'DATA CP CON'!M9","v":8946},{"$f":"'DATA CP CON'!N9","v":8897},{"$f":"'DATA CP CON'!O9","v":8877},{"$f":"'DATA CP CON'!P9","v":8877},null,"Clackmannanshire",7.0921985815602833,4.2128603104212861,5.2338530066815148,7.9365079365079367,6.0694616162751487,9.2373549622620246,6.3084375352033346]
["Dumfries and Galloway",136,139,176,217,34,53,72,null,{"$f":"'DATA CP CON'!J10","v":23614},{"$f":"'DATA CP CON'!K10","v":23487},{"$f":"'DATA CP CON'!L10","v":23424},{"$f":"'DATA CP CON'!M10","v":23243},{"$f":"'DATA CP CON'!N10","v":23050},{"$f":"'DATA CP CON'!O10","v":22882},{"$f":"'DATA CP CON'!P10","v":22882},null,"Dumfries and Galloway",5.7592953332768699,5.9181674969131857,7.5136612021857925,9.3361442154627206,1.4750542299349241,2.3162310986801855,3.1465780963202516]
{"$rows_left_out":32}
{"sheet":"REF EA Name","index":9,"n_rows":35,"n_cols":2,"rows_kept":35,"cut":false,"hidden":true,"merged":[]}
["EA Code","EA Name"]
[]
[100,"Aberdeen City"]
[110,"Aberdeenshire"]
[120,"Angus"]
[130,"Argyll & Bute"]
[230,"City of Edinburgh"]
[150,"Clackmannanshire"]
[170,"Dumfries & Galloway"]
[180,"Dundee City"]
{"$rows_left_out":26}
{"sheet":"REF CAS2","index":10,"n_rows":33,"n_cols":12,"rows_kept":33,"cut":false,"hidden":true,"merged":[]}
[]
[100,"Aberdeen City","City of Edinburgh","****","Dundee City","***","South Ayrshire","***","Argyll and Bute","***","Renfrewshire","***"]
[110,"Aberdeenshire","Stirling","****","Perth and Kinross","****","Highland","****","Scottish Borders","****","South Lanarkshire","****"]
[120,"Angus","Highland","*****","Dumfries and Galloway","*****","Moray","*****","Scottish Borders","****","South Ayrshire","****"]
[130,"Argyll & Bute","South Ayrshire","*****","Dumfries and Galloway","****","Scottish Borders","****","Highland","****","Angus","****"]
[230,"City of Edinburgh","Aberdeen City","****","Dundee City","**","South Ayrshire","**","Argyll and Bute","**","Renfrewshire","**"]
[150,"Clackmannanshire","North Lanarkshire","*****","West Lothian","****","Falkirk","****","South Lanarkshire","****","East Ayrshire","****"]
[170,"Dumfries & Galloway","Angus","*****","Highland","****","Argyll and Bute","****","Scottish Borders","****","Moray","****"]
[180,"Dundee City","Aberdeen City","***","Renfrewshire","***","Dumfries and Galloway","***","Inverclyde","***","South Ayrshire","***"]
[190,"East Ayrshire","North Lanarkshire","*****","Clackmannanshire","****","Falkirk","****","North Ayrshire","****","West Lothian","****"]
{"$rows_left_out":24}
{"sheet":"REF CAs","index":11,"n_rows":70,"n_cols":11,"rows_kept":70,"cut":false,"hidden":true,"merged":[]}
[1,{"$f":"INDEX($J$1:$K$32,MATCH(C39,$J$1:$J$32,0),2)","v":5},{"$f":"INDEX($J$1:$K$32,MATCH(D39,$J$1:$J$32,0),2)","v":8},{"$f":"INDEX($J$1:$K$32,MATCH(E39,$J$1:$J$32,0),2)","v":28},{"$f":"INDEX($J$1:$K$32,MATCH(F39,$J$1:$J$32,0),2)","v":4},{"$f":"INDEX($J$1:$K$32,MATCH(G39,$J$1:$J$32,0),2)","v":25},null,null,"Aberdeen City","Aberdeen City",1]
[2,{"$f":"INDEX($J$1:$K$32,MATCH(C40,$J$1:$J$32,0),2)","v":30},24,16,26,29,null,null,"Aberdeenshire","Aberdeenshire",2]
[3,16,7,19,26,28,null,null,"Angus","Angus",3]
[4,28,7,26,16,3,null,null,"Argyll and Bute","Argyll and Bute",4]
[5,1,8,28,4,25,null,null,"Clackmannanshire","City of Edinburgh",5]
[6,22,32,13,29,9,null,null,"Dumfries and Galloway","Clackmannanshire",6]
[7,3,16,4,26,19,null,null,"Dundee City","Dumfries and Galloway",7]
[8,1,25,7,17,28,null,null,"East Ayrshire","Dundee City",8]
[9,22,6,13,21,32,null,null,"East Dunbartonshire","East Ayrshire",9]
[10,12,30,11,2,24,null,null,"East Lothian","East Dunbartonshire",10]
{"$rows_left_out":60}