{"text_format":"3","workbook":"xlsx","n_sheets":49,"sheets":["List of Charts","FRONT PAGE INFOGRAPHIC","A1. Headline Chart","A1. Headline Chart data","A2. Headline Chart","A2. Headline Chart data","Chart B1","Chart B1 data","Chart B2","Chart B2 data","Chart B3","Chart B3 data","Chart B4","Chart B4 data","Chart B5","Chart B5 data","Chart B6","Chart B6 data","Chart B7","Chart B7 data","Chart B8","Chart B8 data","Chart B9","Chart B9 data","Chart B10","Chart B10 data","Chart B11","Chart B11 data","Chart B12","Chart B12 data","Chart C1","Chart C1 data","Chart C2","Chart C2 data","Chart C3","Chart C4","Charts C3 and C4 data","Chart C5","Chart C5 data","Chart D1","Chart D1 data","Chart D2","Chart D2 data ","Chart D3","Chart D3 data","Chart D4","Chart D4 data","Chart D5","Chart D5 data"],"not_rendered":{"charts":48,"images":1,"external_links":9,"defined_names":83},"unopened":[{"sheet":"A1. Headline Chart","index":2,"reason":"not_a_worksheet"},{"sheet":"A2. Headline Chart","index":4,"reason":"not_a_worksheet"},{"sheet":"Chart B1","index":6,"reason":"not_a_worksheet"},{"sheet":"Chart B2","index":8,"reason":"not_a_worksheet"},{"sheet":"Chart B3","index":10,"reason":"not_a_worksheet"},{"sheet":"Chart B4","index":12,"reason":"not_a_worksheet"},{"sheet":"Chart B5","index":14,"reason":"not_a_worksheet"},{"sheet":"Chart B6","index":16,"reason":"not_a_worksheet"},{"sheet":"Chart B7","index":18,"reason":"not_a_worksheet"},{"sheet":"Chart B8","index":20,"reason":"not_a_worksheet"},{"sheet":"Chart B9","index":22,"reason":"not_a_worksheet"},{"sheet":"Chart B10","index":24,"reason":"not_a_worksheet"},{"sheet":"Chart B11","index":26,"reason":"not_a_worksheet"},{"sheet":"Chart B12","index":28,"reason":"not_a_worksheet"},{"sheet":"Chart C1","index":30,"reason":"not_a_worksheet"},{"sheet":"Chart C2","index":32,"reason":"not_a_worksheet"},{"sheet":"Chart C3","index":34,"reason":"not_a_worksheet"},{"sheet":"Chart C4","index":35,"reason":"not_a_worksheet"},{"sheet":"Chart C5","index":37,"reason":"not_a_worksheet"},{"sheet":"Chart D1","index":39,"reason":"not_a_worksheet"},{"sheet":"Chart D2","index":41,"reason":"not_a_worksheet"},{"sheet":"Chart D3","index":43,"reason":"not_a_worksheet"},{"sheet":"Chart D4","index":45,"reason":"not_a_worksheet"},{"sheet":"Chart D5","index":47,"reason":"not_a_worksheet"}],"read":"whole","date_system":"1900"}

{"sheet":"List of Charts","index":0,"n_rows":35,"n_cols":2,"rows_kept":35}
["CHARTS"]
[]
["SECTION A"]
["Front Page Infographic"]
["Headline Chart 1","Scottish Greenhouse Gas Emissions, 1990 to 2016.  Values in MtCO2e"]
["Headline Chart 2","Scottish Greenhouse Gas Emissions, Adjusted for the EU Emissions Trading System, (EU ETS). 1990 to 2016. Values in MtCO2e"]
[]
["SECTION B"]
["Chart B1","Sources of Scottish Greenhouse Gas Emissions, 2016. Values in MtCO2e"]
["Chart B2","Main Sources of Greenhouse Gas Emissions in Scotland, 1990 to 2016. Values in MtCO2e"]
["Chart B3","Generation of electricity by fuel, Scotland, 2004 to 2016.  Percentage of electricity generated by year"]
["Chart B4","Gas and Coal prices for large users in the UK (2004 to 2016) - pence per kWh"]
["Chart B5","Change in Net Emissions by Scottish Government sector between 1990 and 2016 - in MtCO2e and percentage changes"]
["Chart B6","Change in Net Emissions by Scottish Government sector between 2014 and 2016 - in MtCO2e and percentage changes"]
["Chart B7","Mean air temperature by month, Scotland. 2014 and 2016.  Values in °C "]
["Chart B8","Scottish Greenhouse Gases, by gas, 1990 to 2016.  Values in MtCO2e"]
["Chart B9","Carbon dioxide (CO2) emissions by Scottish Government sector, 1990 to 2016, Values in MtCO2e"]
["Chart B10","Methane (CH4) emissions by Scottish Government sector, 1990 to 2016.  Values in MtCO2e"]
["Chart B11","Nitrous oxide (N2O) emissions by Scottish Government sector, 1990 to 2016.  Values in MtCO2e"]
["Chart B12","F gas emissions by Scottish Government sector, 1990 to 2016.  Values in MtCO2e"]
[]
["SECTION C"]
["Chart C1","Estimate of Traded Emissions Surrendered in the EU Emissions Trading System (EU ETS) and Non-Traded Greenhouse Gas Emissions by Scottish Government Sector, 2016.  Values in MtCO2e"]
["Chart C2","Calculation of Adjusted Emissions to take into account of trading in the EU Emissions Trading System (EU ETS), 2016.  Values in MtCO2e"]
["Chart C3","Percentage reductions targets - Based on adjusted emissions.  Values in MtCO2e"]
["Chart C4","Comparison of Adjusted emissions and the Fixed Annual Targets which are based on 1990-2008 inventory.  Values in MtCO2e"]
["Chart C5","Greenhouse Gases Adjusted to take into account of trading in the EU Emissions Trading System (EU ETS). Values in MtCO2e"]
[]
["SECTION D"]
["Chart D1","Scottish Greenhouse Gas Emissions.  Comparison of 1990-2015 and 1990-2016 Inventories. Values in MtCO2e"]
["Chart D2","Revisions to emissions in the Baseline Period, from the 1990-2015 inventory to the 1990-2016 inventory, by source sector.  Values in MtCO2e, and percentage changes  "]
["Chart D3","Revisions to emissions in 2015, from the 1990-2015 inventory to the 1990-2016 inventory, by source sector.  Values in MtCO2e, and percentage changes"]
["Chart D4","Revisions to emissions in the Baseline Period, from the 1990-2008 inventory, to the latest inventory.  Impact of year-on-year revisions.  Values in MtCO2e"]
["Chart D5","Scottish Greenhouse Gas Emissions, Comparison of 1990-2008 and 1990-2016 Inventories. Values in MtCO2e"]
["Chart D6","Revisions to the Baseline, from the 1990-2008 Inventory to the Latest Inventory (1990-2016), by source sector.  Impact of Successive Revisions.  Values in MtCO2e, and percentage changes "]

{"sheet":"FRONT PAGE INFOGRAPHIC","index":1,"n_rows":0,"n_cols":0,"rows_kept":0}

{"sheet":"A1. Headline Chart data","index":3,"n_rows":4,"n_cols":32,"rows_kept":4}
["Scottish Greenhouse Gas Emissions, 1990 to 2016.  Values in MtCO2e"]
[]
["Baseline Period",1990,1991,1992,1993,1994,1995,1996,1997,1998,1999,2000,2001,2002,2003,2004,2005,2006,2007,2008,2009,2010,2011,2012,2013,2014,2015,2016,"% change 2015 to 2016","change 2015 to 2016","% change 1990 to 2016","change 1990 to 2016"]
[{"v":75.68784905878555,"d":"75.7"},{"v":75.59583089082136,"d":"75.6"},{"$nulls":4},{"v":75.55267192997547,"d":"75.6"},null,null,{"v":74.15235157475476,"d":"74.2"},{"v":70.90328943181305,"d":"70.9"},{"v":71.99046284487693,"d":"72.0"},{"v":71.31210533764722,"d":"71.3"},{"v":67.02675087356991,"d":"67.0"},{"v":66.61594878909973,"d":"66.6"},{"v":64.1232963024878,"d":"64.1"},{"v":62.112226296694615,"d":"62.1"},{"v":64.32563724290605,"d":"64.3"},{"v":59.945756624268206,"d":"59.9"},{"v":58.64389337842914,"d":"58.6"},{"v":54.217467406900795,"d":"54.2"},{"v":55.823196249694526,"d":"55.8"},{"v":49.162921951171306,"d":"49.2"},{"v":51.456868100149684,"d":"51.5"},{"v":48.394279053135755,"d":"48.4"},{"v":44.35947734327685,"d":"44.4"},{"v":43.00581593138048,"d":"43.0"},{"v":38.57425878947116,"d":"38.6"},{"$f":"(AB4-AA4)/AA4","v":{"v":-0.10304553107375658,"d":"-10.3%"}},{"$f":"AB4-AA4","v":{"v":-4.431557141909323,"d":"-4.4"}},{"$f":"(AB4-B4)/B4","v":{"v":-0.48973034180705405,"d":"-49.0%"}},{"$f":"AB4-B4","v":{"v":-37.0215721013502,"d":"-37.0"}}]

{"sheet":"A2. Headline Chart data","index":5,"n_rows":4,"n_cols":31,"rows_kept":4}
["Scottish Greenhouse Gas Emissions.  Adjusted for the EU Emissions Trading System, (EU ETS), Baseline Period to 2016.  Values in MtCO2e"]
[]
["Baseline Period",1991,1992,1993,1994,1995,1996,1997,1998,1999,2000,2001,2002,2003,2004,2005,2006,2007,2008,2009,2010,2011,2012,2013,2014,2015,2016,"% change 2015 to 2016","change 2015 to 2016","% change Baseline to 2016","change Baseline to 2016"]
[{"v":75.68784905878555,"d":"75.7"},{"$nulls":4},{"v":75.55267192997547,"d":"75.6"},null,null,{"v":74.15235157475476,"d":"74.2"},{"v":70.90328943181305,"d":"70.9"},{"v":71.99046284487693,"d":"72.0"},{"v":71.31210533764722,"d":"71.3"},{"v":67.02675087356991,"d":"67.0"},{"v":66.61594878909973,"d":"66.6"},{"v":64.1232963024878,"d":"64.1"},{"v":62.86526404350645,"d":"62.9"},{"v":60.55657398971789,"d":"60.6"},{"v":59.66830937108004,"d":"59.7"},{"v":57.785240378429144,"d":"57.8"},{"v":55.16305140690079,"d":"55.2"},{"v":54.721617249694525,"d":"54.7"},{"v":52.045624951171305,"d":"52.0"},{"v":54.22680281848274,"d":"54.2"},{"v":45.157875766739856,"d":"45.2"},{"v":39.54108411797707,"d":"39.5"},{"v":40.45916676016883,"d":"40.5"},{"v":41.48102179139311,"d":"41.5"},{"$f":"(AA4-Z4)/Z4","v":{"v":0.025256452691711836,"d":"2.5%"}},{"$f":"AA4-Z4","v":{"v":1.021855031224284,"d":"1.0"}},{"$f":"(AA4-$A4)/$A4","v":{"v":-0.4519460876847555,"d":"-45.2%"}},{"$f":"AA4-$A4","v":{"v":-34.206827267392434,"d":"-34.2"}}]

{"sheet":"Chart B1 data","index":7,"n_rows":13,"n_cols":3,"rows_kept":13}
["Sources of Scottish Greenhouse Gas Emissions, 2016.  Values in MtCO2e"]
[]
["Source Sector",2016,"% share of 2016"]
["Total greenhouse gas emissions",{"v":38.5742587894712,"d":"38.6"},{"$f":"B4/B$4","v":{"v":1,"d":"100%"}}]
["Transport (including International Aviation and Shipping)",{"v":14.397272557731657,"d":"14.4"},{"$f":"B5/B$4","v":{"v":0.37323523534978137,"d":"37%"}}]
["Agriculture and Related Land Use",{"v":10.049052861385226,"d":"10.0"},{"$f":"B6/B$4","v":{"v":0.26051188478385234,"d":"26%"}}]
["Business and Industrial process",{"v":8.56959345960452,"d":"8.6"},{"$f":"B7/B$4","v":{"v":0.22215834415316307,"d":"22%"}}]
["Energy Supply",{"v":7.159352393156618,"d":"7.2"},{"$f":"B8/B$4","v":{"v":0.18559922128978806,"d":"19%"}}]
["Residential",{"v":6.315866349380111,"d":"6.3"},{"v":0.1637326690799311,"d":"16%"}]
["Development",{"v":2.02380440492892,"d":"2.0"},{"$f":"B10/B$4","v":{"v":0.05246515340642954,"d":"5%"}}]
["Waste Management",{"v":1.6417933315883455,"d":"1.6"},{"$f":"B11/B$4","v":{"v":0.04256188927825805,"d":"4%"}}]
["Public Sector Buildings",{"v":1.080873847672729,"d":"1.1"},{"v":0.02802059926988804,"d":"3%"}]
["Forestry",{"v":-12.663350415976959,"d":"-12.7"},{"v":-0.3282849966110925,"d":"-33%"}]

{"sheet":"Chart B2 data","index":9,"n_rows":17,"n_cols":25,"rows_kept":17}
["Greenhouse Gas Emissions in Scotland by source sector: Baseline Period, 1990 to 2016.  Values in MtCO2e"]
[]
[]
["Source Sector","Baseline Period",1990,1995,1998,1999,2000,2001,2002,2003,2004,2005,2006,2007,2008,2009,2010,2011,2012,2013,2014,2015,2016,"Change between 1990 and 2016","% change between 1990 and 2016"]
["Total greenhouse gas emissions",{"v":75.68784905878555,"d":"75.7"},{"v":75.59583089082136,"d":"75.6"},{"v":75.55267192997547,"d":"75.6"},{"v":74.15235157475476,"d":"74.2"},{"v":70.90328943181305,"d":"70.9"},{"v":71.99046284487693,"d":"72.0"},{"v":71.31210533764722,"d":"71.3"},{"v":67.02675087356991,"d":"67.0"},{"v":66.61594878909973,"d":"66.6"},{"v":64.1232963024878,"d":"64.1"},{"v":62.112226296694615,"d":"62.1"},{"v":64.32563724290605,"d":"64.3"},{"v":59.945756624268206,"d":"59.9"},{"v":58.64389337842914,"d":"58.6"},{"v":54.217467406900795,"d":"54.2"},{"v":55.823196249694526,"d":"55.8"},{"v":49.162921951171306,"d":"49.2"},{"v":51.456868100149684,"d":"51.5"},{"v":48.394279053135755,"d":"48.4"},{"v":44.35947734327685,"d":"44.4"},{"v":43.00581593138048,"d":"43.0"},{"v":38.57425878947116,"d":"38.6"},{"$f":"W5-C5","v":{"v":-37.0215721013502,"d":"-37.0"}},{"$f":"(W5-C5)/C5","v":{"v":-0.48973034180705405,"d":"-49.0%"}}]
["Energy Supply",{"v":22.73372767912457,"d":"22.7"},{"v":22.73372767912457,"d":"22.7"},{"v":26.755699086839662,"d":"26.8"},{"v":25.788610983405242,"d":"25.8"},{"v":23.356719562169157,"d":"23.4"},{"v":26.283172097086126,"d":"26.3"},{"v":25.614008443918227,"d":"25.6"},{"v":23.535452573019434,"d":"23.5"},{"v":23.706476063245237,"d":"23.7"},{"v":21.92646666090184,"d":"21.9"},{"v":20.772660146843794,"d":"20.8"},{"v":24.655482335676677,"d":"24.7"},{"v":21.408253674659395,"d":"21.4"},{"v":20.078605453549482,"d":"20.1"},{"v":18.686940935430314,"d":"18.7"},{"v":20.88647136600246,"d":"20.9"},{"v":17.021587052855402,"d":"17.0"},{"v":17.41930233604674,"d":"17.4"},{"v":15.965981393105,"d":"16.0"},{"v":13.862349033189185,"d":"13.9"},{"v":12.21861147220079,"d":"12.2"},{"v":7.159352393156618,"d":"7.2"},{"$f":"W6-C6","v":{"v":-15.574375285967953,"d":"-15.6"}},{"$f":"(W6-C6)/C6","v":{"v":-0.6850779381979335,"d":"-68.5%"}}]
["Transport (including International Aviation and Shipping)",{"v":14.761265833029025,"d":"14.8"},{"v":14.761265833029023,"d":"14.8"},{"v":15.711687809387032,"d":"15.7"},{"v":16.35111246236676,"d":"16.4"},{"v":16.277443470276587,"d":"16.3"},{"v":15.57499850538174,"d":"15.6"},{"v":15.419718110123862,"d":"15.4"},{"v":15.777368591784942,"d":"15.8"},{"v":15.55685328864839,"d":"15.6"},{"v":15.659289317951478,"d":"15.7"},{"v":15.837510740841779,"d":"15.8"},{"v":15.823606548219047,"d":"15.8"},{"v":16.137636762530356,"d":"16.1"},{"v":15.539163989580281,"d":"15.5"},{"v":14.857172684788509,"d":"14.9"},{"v":14.337474103561567,"d":"14.3"},{"v":13.923373916674361,"d":"13.9"},{"v":13.671272676411522,"d":"13.7"},{"v":13.558424127513515,"d":"13.6"},{"v":13.765500308614358,"d":"13.8"},{"v":14.07769135365837,"d":"14.1"},{"v":14.39727255773166,"d":"14.4"},{"$f":"W7-C7","v":{"v":-0.36399327529736425,"d":"-0.4"}},{"$f":"(W7-C7)/C7","v":{"v":-0.024658676255454478,"d":"-2.5%"}}]
["        Transport (excluding IA&S)",{"v":13.460198778295803,"d":"13.5"},{"v":13.460198778295801,"d":"13.5"},{"v":14.236025771554763,"d":"14.2"},{"v":14.620893940076577,"d":"14.6"},{"v":14.715004479869895,"d":"14.7"},{"v":14.165174862528643,"d":"14.2"},{"v":13.88747051451405,"d":"13.9"},{"v":14.402191899556538,"d":"14.4"},{"v":14.242111821575806,"d":"14.2"},{"v":14.168023403996552,"d":"14.2"},{"v":14.236862001358773,"d":"14.2"},{"v":14.136001847379662,"d":"14.1"},{"v":14.399458534063307,"d":"14.4"},{"v":13.766616342555405,"d":"13.8"},{"v":13.232786077825375,"d":"13.2"},{"v":12.911730059301007,"d":"12.9"},{"v":12.375916266258146,"d":"12.4"},{"v":12.21584523213194,"d":"12.2"},{"v":12.027234679618676,"d":"12.0"},{"v":12.151025885897132,"d":"12.2"},{"v":12.379396946657563,"d":"12.4"},{"v":12.57942652624027,"d":"12.6"},{"$f":"W8-C8","v":{"v":-0.8807722520555306,"d":"-0.9"}},{"v":-0.06543530794476464,"d":"-6.5%"}]
["        International Aviation and Shipping (IA&S)",{"v":1.3010670547332226,"d":"1.3"},{"v":1.3010670547332226,"d":"1.3"},{"v":1.4756620378322676,"d":"1.5"},{"v":1.730218522290182,"d":"1.7"},{"v":1.5624389904066929,"d":"1.6"},{"v":1.4098236428530977,"d":"1.4"},{"v":1.532247595609813,"d":"1.5"},{"v":1.3751766922284037,"d":"1.4"},{"v":1.314741467072584,"d":"1.3"},{"v":1.4912659139549274,"d":"1.5"},{"v":1.600648739483006,"d":"1.6"},{"v":1.687604700839383,"d":"1.7"},{"v":1.7381782284670502,"d":"1.7"},{"v":1.7725476470248753,"d":"1.8"},{"v":1.6243866069631339,"d":"1.6"},{"v":1.4257440442605576,"d":"1.4"},{"v":1.5474576504162152,"d":"1.5"},{"v":1.4554274442795831,"d":"1.5"},{"v":1.5311894478948394,"d":"1.5"},{"v":1.6144744227172276,"d":"1.6"},{"v":1.6982944070008068,"d":"1.7"},{"v":1.8178460314913876,"d":"1.8"},{"v":0.516778976758165,"d":"0.5"},{"v":0.3971962666168101,"d":"39.7%"}]
["Agriculture and Related Land Use",{"v":13.917607138493755,"d":"13.9"},{"v":13.917607138493755,"d":"13.9"},{"v":14.133385634275069,"d":"14.1"},{"v":14.02439821965809,"d":"14.0"},{"v":13.911501751229613,"d":"13.9"},{"v":13.677067182912207,"d":"13.7"},{"v":13.23211059560179,"d":"13.2"},{"v":12.882190888854105,"d":"12.9"},{"v":12.97123441484144,"d":"13.0"},{"v":12.536972169701311,"d":"12.5"},{"v":12.285958653053973,"d":"12.3"},{"v":11.918420157739302,"d":"11.9"},{"v":11.904224975395497,"d":"11.9"},{"v":11.242305809347823,"d":"11.2"},{"v":11.174535345263054,"d":"11.2"},{"v":11.115648481086849,"d":"11.1"},{"v":10.713281024730195,"d":"10.7"},{"v":10.514074756344565,"d":"10.5"},{"v":10.428899147401482,"d":"10.4"},{"v":10.44587060441735,"d":"10.4"},{"v":10.160902316809796,"d":"10.2"},{"v":10.049052861385226,"d":"10.0"},{"v":-3.8685542771085295,"d":"-3.9"},{"v":-0.2779611637699386,"d":"-27.8%"}]
["Business and Industrial process",{"v":14.432721492883406,"d":"14.4"},{"v":14.398678659135406,"d":"14.4"},{"v":11.183617991493792,"d":"11.2"},{"v":11.162865544929277,"d":"11.2"},{"v":11.386777782811475,"d":"11.4"},{"v":11.294899480726873,"d":"11.3"},{"v":11.603871427536028,"d":"11.6"},{"v":10.787847931207768,"d":"10.8"},{"v":10.992339139273202,"d":"11.0"},{"v":10.93663811515521,"d":"10.9"},{"v":10.562717434177497,"d":"10.6"},{"v":10.295558719191853,"d":"10.3"},{"v":9.947878979737625,"d":"9.9"},{"v":10.440119552250032,"d":"10.4"},{"v":9.212970243104953,"d":"9.2"},{"v":9.419196523576844,"d":"9.4"},{"v":9.109260811370149,"d":"9.1"},{"v":9.002199572749303,"d":"9.0"},{"v":9.185229427597813,"d":"9.2"},{"v":8.670951233491797,"d":"8.7"},{"v":8.668783512981232,"d":"8.7"},{"v":8.56959345960452,"d":"8.6"},{"$f":"W11-C11","v":{"v":-5.829085199530887,"d":"-5.8"}},{"$f":"(W11-C11)/C11","v":{"v":-0.4048347308475113,"d":"-40.5%"}}]
["Residential",{"v":8.060449787785258,"d":"8.1"},{"v":8.002474453569075,"d":"8.0"},{"v":7.843106934693921,"d":"7.8"},{"v":8.067813663820708,"d":"8.1"},{"v":7.958271042484511,"d":"8.0"},{"v":7.818573924093492,"d":"7.8"},{"v":8.31657998576662,"d":"8.3"},{"v":7.610844679923262,"d":"7.6"},{"v":7.606268905712861,"d":"7.6"},{"v":7.765078886797249,"d":"7.8"},{"v":7.708354199197076,"d":"7.7"},{"v":7.503006869515877,"d":"7.5"},{"v":7.266413964442026,"d":"7.3"},{"v":7.471506513442374,"d":"7.5"},{"v":7.180210885366898,"d":"7.2"},{"v":8.01353573835949,"d":"8.0"},{"v":6.487329873986416,"d":"6.5"},{"v":7.027330477380321,"d":"7.0"},{"v":7.066100947536707,"d":"7.1"},{"v":5.939297637338415,"d":"5.9"},{"v":6.111750932083385,"d":"6.1"},{"v":6.315866349380111,"d":"6.3"},{"v":-1.6866081041889638,"d":"-1.7"},{"v":-0.21076082328969417,"d":"-21.1%"}]
["Waste Management",{"v":6.028898948641075,"d":"6.0"},{"v":6.028898948641075,"d":"6.0"},{"v":6.23229304933958,"d":"6.2"},{"v":6.0742400139856745,"d":"6.1"},{"v":5.841250713918729,"d":"5.8"},{"v":5.717962776288399,"d":"5.7"},{"v":5.383855734760847,"d":"5.4"},{"v":5.195605485194891,"d":"5.2"},{"v":5.064769333191435,"d":"5.1"},{"v":4.442156901066763,"d":"4.4"},{"v":4.040151611814831,"d":"4.0"},{"v":3.625365016563159,"d":"3.6"},{"v":3.2489726335641205,"d":"3.2"},{"v":3.098372893026002,"d":"3.1"},{"v":2.775842096885446,"d":"2.8"},{"v":2.5376111888639037,"d":"2.5"},{"v":2.4027163469659856,"d":"2.4"},{"v":2.055262298786766,"d":"2.1"},{"v":1.4530815469608493,"d":"1.5"},{"v":1.4693437459795862,"d":"1.5"},{"v":1.7258379131087094,"d":"1.7"},{"v":1.6417933315883455,"d":"1.6"},{"v":-4.387105617052729,"d":"-4.4"},{"v":-0.7276794078695896,"d":"-72.8%"}]
["Other sources *",{"$f":"(B15+B16)","v":{"v":3.5801060772742046,"d":"3.6"}},{"$f":"(C15+C16)","v":{"v":3.5801060772742046,"d":"3.6"}},{"v":3.677022166544215,"d":"3.7"},{"v":3.6329174540144606,"d":"3.6"},{"v":3.622620335952221,"d":"3.6"},{"v":3.4989535953771176,"d":"3.5"},{"v":3.5244240037078693,"d":"3.5"},{"v":3.2953792973391813,"d":"3.3"},{"v":3.352618709739585,"d":"3.4"},{"v":3.558052855485058,"d":"3.6"},{"v":3.5075138411592475,"d":"3.5"},{"v":3.201946509928427,"d":"3.2"},{"v":3.143214322950976,"d":"3.1"},{"v":3.1950830734425812,"d":"3.2"},{"v":3.0613380968319905,"d":"3.1"},{"v":3.207936101920354,"d":"3.2"},{"v":2.9717413612537715,"d":"3.0"},{"v":3.0873673851880428,"d":"3.1"},{"v":3.1261964222770677,"d":"3.1"},{"v":2.9027338047516063,"d":"2.9"},{"v":2.9329317708239087,"d":"2.9"},{"$f":"(W15+W16)","v":{"v":3.1046782526016488,"d":"3.1"}},{"v":-0.47542782467255584,"d":"-0.5"},{"v":-0.1327971334957018,"d":"-13.3%"}]
["        Development",{"v":1.8915056233148553,"d":"1.9"},{"v":1.8915056233148553,"d":"1.9"},{"v":1.869772772788841,"d":"1.9"},{"v":1.86167402415193,"d":"1.9"},{"v":1.873226874617659,"d":"1.9"},{"v":1.8532142400521123,"d":"1.9"},{"v":1.840364019895547,"d":"1.8"},{"v":1.8623060074131392,"d":"1.9"},{"v":1.9245637907023256,"d":"1.9"},{"v":2.004664040075341,"d":"2.0"},{"v":1.9800938074623413,"d":"2.0"},{"v":1.8225522338426832,"d":"1.8"},{"v":1.8630901863570872,"d":"1.9"},{"v":1.8626445778056342,"d":"1.9"},{"v":1.8663497654986445,"d":"1.9"},{"v":1.9309166081202986,"d":"1.9"},{"v":1.9147954588732443,"d":"1.9"},{"v":1.893604343964717,"d":"1.9"},{"v":1.9274366665319045,"d":"1.9"},{"v":1.8797522463412857,"d":"1.9"},{"v":1.8723437562961636,"d":"1.9"},{"v":2.02380440492892,"d":"2.0"},{"v":0.1322987816140646,"d":"0.1"},{"v":0.06994363642557487,"d":"7.0%"}]
["        Public Sector Buildings",{"v":1.6886004539593495,"d":"1.7"},{"v":1.6886004539593495,"d":"1.7"},{"v":1.8072493937553737,"d":"1.8"},{"v":1.7712434298625306,"d":"1.8"},{"v":1.7493934613345623,"d":"1.7"},{"v":1.6457393553250055,"d":"1.6"},{"v":1.6840599838123222,"d":"1.7"},{"v":1.4330732899260419,"d":"1.4"},{"v":1.4280549190372593,"d":"1.4"},{"v":1.553388815409717,"d":"1.6"},{"v":1.527420033696906,"d":"1.5"},{"v":1.3793942760857438,"d":"1.4"},{"v":1.280124136593889,"d":"1.3"},{"v":1.3324384956369468,"d":"1.3"},{"v":1.1949883313333463,"d":"1.2"},{"v":1.2770194938000554,"d":"1.3"},{"v":1.0569459023805272,"d":"1.1"},{"v":1.1937630412233258,"d":"1.2"},{"v":1.1987597557451632,"d":"1.2"},{"v":1.0229815584103208,"d":"1.0"},{"v":1.0605880145277449,"d":"1.1"},{"v":1.080873847672729,"d":"1.1"},{"v":-0.6077266062866205,"d":"-0.6"},{"v":-0.3598995871768554,"d":"-36.0%"}]
["Forestry",{"v":-7.8269278984457396,"d":"-7.8"},{"v":-7.8269278984457396,"d":"-7.8"},{"v":-9.984140742597793,"d":"-10.0"},{"v":-10.949606767425442,"d":"-10.9"},{"v":-11.451295227029238,"d":"-11.5"},{"v":-11.875164716989024,"d":"-11.9"},{"v":-11.782462963768012,"d":"-11.8"},{"v":-12.057938573753663,"d":"-12.1"},{"v":-12.634611065552427,"d":"-12.6"},{"v":-12.701358604571114,"d":"-12.7"},{"v":-12.602640330393578,"d":"-12.6"},{"v":-12.697748913928269,"d":"-12.7"},{"v":-13.110838689011787,"d":"-13.1"},{"v":-12.421263906209424,"d":"-12.4"},{"v":-12.731542880770373,"d":"-12.7"},{"v":-13.69467725367695,"d":"-13.7"},{"v":-13.466368436664967,"d":"-13.5"},{"v":-11.319941402757586,"d":"-11.3"},{"v":-12.389633959256683,"d":"-12.4"},{"v":-12.696569024505445,"d":"-12.7"},{"v":-12.890693340285708,"d":"-12.9"},{"v":-12.663350415976959,"d":"-12.7"},{"v":-4.836422517531219,"d":"-4.8"},{"$f":"(W17-C17)/C17","v":{"v":0.6179209238009755,"d":"61.8%"}}]

{"sheet":"Chart B3 data","index":11,"n_rows":17,"n_cols":18,"rows_kept":17}
["Generation of electricity by fuel in Scotland, 2000 to 2016"]
[]
[]
[]
["Electricity Generation by Fuel (GWh), Scotland, 2000-2016"]
[null,2000,2001,2002,2003,2004,2005,2006,2007,2008,2009,2010,2011,2012,2013,2014,2015,2016]
["Nuclear",{"v":16918,"d":"16,918"},{"v":18097,"d":"18,097"},{"v":15828,"d":"15,828"},{"v":18394,"d":"18,394"},{"v":18012.762836534734,"d":"18,013"},{"v":18680.70825592,"d":"18,681"},{"v":14140.931851956,"d":"14,141"},{"v":12343.704479708002,"d":"12,344"},{"v":15079.202764500002,"d":"15,079"},{"v":16680.776708848003,"d":"16,681"},{"v":15293.023250442,"d":"15,293"},{"v":16891.824995135998,"d":"16,892"},{"v":17050.020931706003,"d":"17,050"},{"v":18497.880919147003,"d":"18,498"},{"v":16633.272788804,"d":"16,633"},{"v":17762.828547744,"d":"17,763"},{"v":19630.453289307003,"d":"19,630"}]
["Renewables",{"v":4971,"d":"4,971"},{"v":4203,"d":"4,203"},{"v":5098,"d":"5,098"},{"v":3725,"d":"3,725"},{"v":5832.200000000001,"d":"5,832"},{"v":6486.00856988711,"d":"6,486"},{"v":6962.799999999999,"d":"6,963"},{"v":8226.14835,"d":"8,226"},{"v":9058.423176159828,"d":"9,058"},{"v":10582.399124162244,"d":"10,582"},{"v":9464.780092790406,"d":"9,465"},{"v":13686.271456399369,"d":"13,686"},{"v":14794.755242612755,"d":"14,795"},{"v":17005.312297499237,"d":"17,005"},{"v":19040.981275074853,"d":"19,041"},{"v":21759.222940014955,"d":"21,759"},{"v":19675.6963814614,"d":"19,676"}]
["Coal *",{"v":16624,"d":"16,624"},{"v":15408,"d":"15,408"},{"v":14861,"d":"14,861"},{"v":14566,"d":"14,566"},{"v":13080.353323950003,"d":"13,080"},{"v":12158.193135628755,"d":"12,158"},{"v":17560.427025002613,"d":"17,560"},{"v":13876.867704719725,"d":"13,877"},{"v":11683.46880711872,"d":"11,683"},{"v":11982.111907086399,"d":"11,982"},{"v":14729.699497180902,"d":"14,730"},{"v":10792.8482796464,"d":"10,793"},{"v":11754.427715848182,"d":"11,754"},{"v":10838.66855642173,"d":"10,839"},{"v":10314.595258343366,"d":"10,315"},{"v":8507.84047161375,"d":"8,508"},{"v":2238.1106740116493,"d":"2,238"}]
["Gas",{"v":8671,"d":"8,671"},{"v":8523,"d":"8,523"},{"v":11034,"d":"11,034"},{"v":10025,"d":"10,025"},{"v":10834.686066600001,"d":"10,835"},{"v":9366.86830306282,"d":"9,367"},{"v":10212.402228768564,"d":"10,212"},{"v":10930.539546170143,"d":"10,931"},{"v":11607.861614924122,"d":"11,608"},{"v":9370.308532403766,"d":"9,370"},{"v":8388.038303159477,"d":"8,388"},{"v":8255.168110111603,"d":"8,255"},{"v":5612.59436854542,"d":"5,613"},{"v":5438.801580244697,"d":"5,439"},{"v":2723.221273701922,"d":"2,723"},{"v":1918.7554673678183,"d":"1,919"},{"v":3129.52140745457,"d":"3,130"}]
["*Coal includes a small quantity of non-renewable wastes and other thermal."]
[]
[]
[]
["Source(s): Generation of electricity by fuel in Scotland, Wales, Northern Ireland and England, 2004 to 2016 (GWh), BEIS"]
["General weblink(s): ","https://www.gov.uk/government/statistics/energy-trends-december-2017-special-feature-article-electricity-generation-and-supply-figures-for-scotland-wales-northern-ireland-and-england-2"]
["Specific data weblink(s): ","https://www.gov.uk/government/uploads/system/uploads/attachment_data/file/669722/regional-generation-2004-2016.xls"]

{"sheet":"Chart B4 data","index":13,"n_rows":15,"n_cols":14,"rows_kept":15}
["Gas and Coal prices for large users in the UK (2004 to 2016) - pence per kWh"]
[]
[]
[null,2004,2005,2006,2007,2008,2009,2010,2011,2012,2013,2014,2015,2016]
["COAL",0.468,0.549,{"v":0.52,"d":"0.520"},0.628,{"v":0.816100022696506,"d":"0.816"},{"v":0.746235424878128,"d":"0.746"},0.856,0.943,0.922,0.949,0.937,0.867,0.789]
["GAS",0.961,1.387,1.804,1.474,{"v":2.11436929057684,"d":"2.114"},1.906,1.738,2.109,2.306,{"v":2.54,"d":"2.540"},2.243,1.932,1.593]
["Right Axis: relative price of Coal (where Gas = 100)",{"v":48.69927159209158,"d":"49"},{"v":39.58183129055516,"d":"40"},{"v":28.824833702882486,"d":"29"},{"v":42.60515603799186,"d":"43"},{"v":38.597799652768245,"d":"39"},{"v":39.15191106391018,"d":"39"},{"v":49.25201380897584,"d":"49"},{"v":44.713134186818394,"d":"45"},{"v":39.98265394622724,"d":"40"},{"v":37.362204724409445,"d":"37"},{"v":41.7744092732947,"d":"42"},{"v":44.87577639751553,"d":"45"},{"v":49.52919020715631,"d":"50"}]
[]
[]
[]
[]
["Source(s): Prices of fuels purchased by manufacturing industry in Great Britain (p/kWh), BEIS"]
["General weblink(s): ","https://www.gov.uk/government/collections/digest-of-uk-energy-statistics-dukes"]
["Specific data weblink(s): ","https://www.gov.uk/government/uploads/system/uploads/attachment_data/file/295522/qep314.xls "]
["Next Update: June 2018"]

{"sheet":"Chart B5 data","index":15,"n_rows":15,"n_cols":3,"rows_kept":15}
["Change in emissions by Scottish Government sector between 1990 and 2016 - in MtCO2e and percentage changes"]
[]
[]
[null,"Change between 1990 and 2016 (in Mt CO2e)","% change between 1990 and 2016"]
["Total greenhouse gas emissions",{"v":-37.0215721013502,"d":"-37.0"},{"v":-0.48973034180705405,"d":"-49.0%"}]
["Energy Supply",{"v":-15.574375285967953,"d":"-15.6"},{"v":-0.6850779381979335,"d":"-68.5%"}]
["Business and Industrial Process",{"v":-5.829085199530887,"d":"-5.8"},{"v":-0.4048347308475113,"d":"-40.5%"}]
["Forestry",{"v":-4.836422517531219,"d":"-4.8"},{"v":0.6179209238009755,"d":"61.8%"}]
["Waste Management",{"v":-4.387105617052729,"d":"-4.4"},{"v":-0.7276794078695896,"d":"-72.8%"}]
["Agriculture and Related Land Use",{"v":-3.8685542771085295,"d":"-3.9"},{"v":-0.2779611637699386,"d":"-27.8%"}]
["Residential",{"v":-1.6866081041889638,"d":"-1.7"},{"v":-0.21076082328969417,"d":"-21.1%"}]
["Transport (excluding international aviation and shipping)",{"v":-0.8807722520555306,"d":"-0.9"},{"v":-0.06543530794476464,"d":"-6.5%"}]
["Public Sector Buildings",{"v":-0.6077266062866205,"d":"-0.6"},{"v":-0.3598995871768554,"d":"-36.0%"}]
["Development",{"v":0.1322987816140646,"d":"0.1"},{"v":0.06994363642557487,"d":"7.0%"}]
["International aviation and shipping",{"v":0.516778976758165,"d":"0.5"},{"v":0.3971962666168101,"d":"39.7%"}]

{"sheet":"Chart B6 data","index":17,"n_rows":15,"n_cols":3,"rows_kept":15}
["Change in emissions by sector between 2015 and 2016- in MtCO2e and percentage changes"]
[]
[]
[null,"Change between 2015 and 2016 (in MtCO2e)","% change between 2015 and 2016"]
["Energy Supply",{"v":-5.059259079044172,"d":"-5.1"},{"v":-0.4140617033739685,"d":"-41.4%"}]
["Total greenhouse gas emissions",{"v":-4.431557141909323,"d":"-4.4"},{"v":-0.10304553107375658,"d":"-10.3%"}]
["Agriculture and Related Land Use",{"v":-0.11184945542457037,"d":"-0.1"},{"v":-0.011007827054840498,"d":"-1.1%"}]
["Business and Industrial Process",{"v":-0.09919005337671294,"d":"-0.1"},{"v":-0.011442211381583002,"d":"-1.1%"}]
["Waste Management",{"v":-0.08404458152036387,"d":"-0.1"},{"v":-0.04869784171618784,"d":"-4.9%"}]
["Public Sector Buildings",{"v":0.020285833144984222,"d":"0.0"},{"v":0.01912696812250611,"d":"1.9%"}]
["International aviation and shipping",{"v":0.11955162449058077,"d":"0.1"},{"v":0.07039511170604942,"d":"7.0%"}]
["Development",{"v":0.15146064863275632,"d":"0.2"},{"v":0.08089361161562182,"d":"8.1%"}]
["Transport (excluding international aviation and shipping)",{"v":0.20002957958270784,"d":"0.2"},{"v":0.016158265256751122,"d":"1.6%"}]
["Residential",{"v":0.2041154172967259,"d":"0.2"},{"v":0.03339720802842773,"d":"3.3%"}]
["Forestry",{"v":0.2273429243087488,"d":"0.2"},{"v":-0.017636206083520872,"d":"-1.8%"}]

{"sheet":"Chart B7 data","index":19,"n_rows":20,"n_cols":20,"rows_kept":20}
["Mean air temperature by month in Scotland, 2015 and 2016.  Values in °C"]
[]
[]
["Year","JAN","FEB","MAR","APR","MAY","JUN","JUL","AUG","SEP","OCT","NOV","DEC","WIN","SPR","SUM","AUT","ANNUAL"]
[2015,2.5,2.9,4.4,6.3,7.6,10.6,12.2,12.9,10.8,8.7,6.2,5.4,{"v":2.87,"d":"2.9"},{"v":6.08,"d":"6.1"},{"v":11.92,"d":"11.9"},{"v":8.58,"d":"8.6"},{"v":7.58,"d":"7.6"},"Difference between 2016 and 2015",{"$f":"R5-R6","v":{"v":-0.25,"d":"-0.3"}}]
[2016,3.1,2.2,4.6,5.1,9.8,12.3,13.1,13.3,12.7,8.4,3.4,5.6,{"v":3.62,"d":"3.6"},6.5,12.9,{"v":8.17,"d":"8.2"},{"v":7.83,"d":"7.8"}]
["1981-2010 average",{"v":2.723333333333333,"d":"2.72"},{"v":2.773333333333334,"d":"2.77"},{"v":4.166666666666666,"d":"4.17"},{"v":6.173333333333333,"d":"6.17"},{"v":8.9,"d":"8.90"},{"v":11.366666666666667,"d":"11.37"},{"v":13.33666666666667,"d":"13.34"},{"v":13.103333333333333,"d":"13.10"},{"v":10.95666666666667,"d":"10.96"},{"v":7.966666666666667,"d":"7.97"},{"v":5.036666666666667,"d":"5.04"},{"v":2.8500000000000005,"d":"2.85"},{"v":2.844666666666666,"d":"2.84"},{"v":6.422,"d":"6.42"},{"v":12.614666666666665,"d":"12.61"},{"v":7.991666666666666,"d":"7.99"},{"v":7.473666666666668,"d":"7.47"},"Difference between 2016 and 1981-2010",{"$f":"R6-R7","v":{"v":0.35633333333333184,"d":"0.4"}}]
[]
["Source: Met Office"]
["http://www.metoffice.gov.uk/pub/data/weather/uk/climate/datasets/Tmean/date/Scotland.txt "]
[]
[]
["Scotland Mean Temperature (Degrees C)"]
["Allowances have been made for topographic, coastal and urban effects where relationships are found to exist."]
["Seasons: Winter=Dec-Feb, Spring=Mar-May, Summer=June-Aug, Autumn=Sept-Nov. (Winter: Year refers to Jan/Feb)."]
["Monthly values are ranked and displayed to 1 dp and seasonal/annual values to 2 dp. Where values are equal, rankings are based in order of year descending."]
[]
[]
[]
["Data obtained May 2017"]

{"sheet":"Chart B8 data","index":21,"n_rows":17,"n_cols":26,"rows_kept":17}
["Scottish Greenhouse Gases, by gas, Baseline Period 1990 to 2016.  Values in MtCO2e"]
[]
[null,"Baseline Period","1990","1995","1998","1999","2000","2001","2002","2003","2004","2005","2006","2007","2008","2009","2010","2011","2012",2013,2014,2015,2016,"Change from 1990 to 2016 (in MtCO2e)","% Change from 1990 to 2016","% Share of Greenhouse Gases 2016"]
["Total Greenhouse Gases",{"v":75.68784905878555,"d":"75.7"},{"v":75.59583089082136,"d":"75.6"},{"v":75.55267192997547,"d":"75.6"},{"v":74.15235157475476,"d":"74.2"},{"v":70.90328943181305,"d":"70.9"},{"v":71.99046284487693,"d":"72.0"},{"v":71.31210533764722,"d":"71.3"},{"v":67.02675087356991,"d":"67.0"},{"v":66.61594878909973,"d":"66.6"},{"v":64.1232963024878,"d":"64.1"},{"v":62.112226296694615,"d":"62.1"},{"v":64.32563724290605,"d":"64.3"},{"v":59.945756624268206,"d":"59.9"},{"v":58.64389337842914,"d":"58.6"},{"v":54.217467406900795,"d":"54.2"},{"v":55.823196249694526,"d":"55.8"},{"v":49.162921951171306,"d":"49.2"},{"v":51.456868100149684,"d":"51.5"},{"v":48.394279053135755,"d":"48.4"},{"v":44.35947734327685,"d":"44.4"},{"v":43.00581593138048,"d":"43.0"},{"v":38.57425878947116,"d":"38.6"},{"$f":"W4-C4","v":{"v":-37.0215721013502,"d":"-37.0"}},{"$f":"(W4-C4)/C4","v":{"v":-0.48973034180705405,"d":"-49.0%"}},{"$f":"W4/W$4","v":{"v":1,"d":"100.0%"}}]
["Carbon dioxide (CO2)",{"v":57.18149912778704,"d":"57.2"},{"v":57.181499127787085,"d":"57.2"},{"v":57.392564196808195,"d":"57.4"},{"v":56.07814971348527,"d":"56.1"},{"v":53.57556984801995,"d":"53.6"},{"v":54.97302114594965,"d":"55.0"},{"v":54.686744040687834,"d":"54.7"},{"v":51.009329170039486,"d":"51.0"},{"v":50.89727576975238,"d":"50.9"},{"v":49.05389340114193,"d":"49.1"},{"v":47.458263948663955,"d":"47.5"},{"v":50.304866377084004,"d":"50.3"},{"v":46.33105196249209,"d":"46.3"},{"v":45.524810212471145,"d":"45.5"},{"v":41.41626052543307,"d":"41.4"},{"v":43.239865112403,"d":"43.2"},{"v":36.90474021568777,"d":"36.9"},{"v":39.54623853580439,"d":"39.5"},{"v":37.187683759772995,"d":"37.2"},{"v":33.013529218412636,"d":"33.0"},{"v":31.397072523848422,"d":"31.4"},{"v":27.200807692449064,"d":"27.2"},{"$f":"W5-C5","v":{"v":-29.98069143533802,"d":"-30.0"}},{"$f":"(W5-C5)/C5","v":{"v":-0.5243075451438985,"d":"-52.4%"}},{"$f":"W5/W$4","v":{"v":0.7051543839352663,"d":"70.5%"}}]
["Methane (CH4)",{"v":13.455381406025639,"d":"13.5"},{"v":13.455381406025635,"d":"13.5"},{"v":13.3357157703974,"d":"13.3"},{"v":12.879557125344848,"d":"12.9"},{"v":12.166669294147175,"d":"12.2"},{"v":11.940951363083865,"d":"11.9"},{"v":11.398283512021191,"d":"11.4"},{"v":10.83366115439108,"d":"10.8"},{"v":10.572298713266463,"d":"10.6"},{"v":9.978797499766019,"d":"10.0"},{"v":9.63014112966633,"d":"9.6"},{"v":9.027113773622744,"d":"9.0"},{"v":8.655063534377666,"d":"8.7"},{"v":8.275291443932877,"d":"8.3"},{"v":7.840946684996547,"d":"7.8"},{"v":7.648501737482219,"d":"7.6"},{"v":7.52444645423353,"d":"7.5"},{"v":7.088676642392471,"d":"7.1"},{"v":6.32885163311718,"d":"6.3"},{"v":6.349438464683445,"d":"6.3"},{"v":6.597822323266807,"d":"6.6"},{"v":6.451418836153826,"d":"6.5"},{"$f":"W6-C6","v":{"v":-7.00396256987181,"d":"-7.0"}},{"$f":"(W6-C6)/C6","v":{"v":-0.5205324441219683,"d":"-52.1%"}},{"$f":"W6/W$4","v":{"v":0.16724673496292145,"d":"16.7%"}}]
["Nitrous oxide (N2O)",{"v":4.584964931792159,"d":"4.6"},{"v":4.584964931792159,"d":"4.6"},{"v":4.365264689434351,"d":"4.4"},{"v":4.388268869054985,"d":"4.4"},{"v":4.3347622314412195,"d":"4.3"},{"v":4.1601738505985875,"d":"4.2"},{"v":4.178025267788959,"d":"4.2"},{"v":4.088927382606724,"d":"4.1"},{"v":4.048561647026407,"d":"4.0"},{"v":3.907568111984323,"d":"3.9"},{"v":3.776996255356398,"d":"3.8"},{"v":3.6878261378422557,"d":"3.7"},{"v":3.6169994717246716,"d":"3.6"},{"v":3.4959916148752384,"d":"3.5"},{"v":3.5353229707804656,"d":"3.5"},{"v":3.5220714014149452,"d":"3.5"},{"v":3.447264130040236,"d":"3.4"},{"v":3.4748338623865966,"d":"3.5"},{"v":3.481794499209683,"d":"3.5"},{"v":3.4895956971100315,"d":"3.5"},{"v":3.436725368330126,"d":"3.4"},{"v":3.3802955629019875,"d":"3.4"},{"v":-1.2046693688901717,"d":"-1.2"},{"v":-0.2627434204647872,"d":"-26.3%"},{"v":0.08763086236733184,"d":"8.8%"}]
["* F gases",{"$f":"SUM(B9:B12)","v":{"v":0.27872545602126997,"d":"0.3"}},{"$f":"SUM(C9:C12)","v":{"v":0.18670728805708656,"d":"0.2"}},{"v":0.27872545602126997,"d":"0.3"},{"v":0.5950387000768961,"d":"0.6"},{"v":0.6484619926820276,"d":"0.6"},{"v":0.7462943669352489,"d":"0.7"},{"v":0.7794501192854222,"d":"0.8"},{"v":0.8830093985783783,"d":"0.9"},{"v":1.00337066013168,"d":"1.0"},{"v":1.0855356330924704,"d":"1.1"},{"v":1.1855806160508402,"d":"1.2"},{"v":1.2526956802333822,"d":"1.3"},{"v":1.3010581129227867,"d":"1.3"},{"v":1.3328575720165619,"d":"1.3"},{"v":1.3971941024943082,"d":"1.4"},{"v":1.4427647721930401,"d":"1.4"},{"v":1.3253458025086766,"d":"1.3"},{"v":1.3729005904490048,"d":"1.4"},{"v":1.4100794552986011,"d":"1.4"},{"v":1.473183458992885,"d":"1.5"},{"v":1.4471446807997241,"d":"1.4"},{"$f":"SUM(W9:W12)","v":{"v":1.4026984209261057,"d":"1.4"}},{"v":1.2159911328690192,"d":"1.2"},{"v":6.512820926932561,"d":"651.3%"},{"v":0.03636358714192513,"d":"3.6%"}]
["       of which HFCs",{"v":0.12641599757222802,"d":"0.1"},{"v":2.12633335046128E-3,"d":"0.0"},{"v":0.12641599757222802,"d":"0.1"},{"v":0.40123582262959484,"d":"0.4"},{"v":0.43565739197677306,"d":"0.4"},{"v":0.5356030742569309,"d":"0.5"},{"v":0.6375489567389396,"d":"0.6"},{"v":0.7134482220792838,"d":"0.7"},{"v":0.8341384118902314,"d":"0.8"},{"v":0.9241346000831745,"d":"0.9"},{"v":1.025095150520039,"d":"1.0"},{"v":1.1114796602307724,"d":"1.1"},{"v":1.1679679547295407,"d":"1.2"},{"v":1.2095777815163313,"d":"1.2"},{"v":1.28085528956465,"d":"1.3"},{"v":1.3267631233215187,"d":"1.3"},{"v":1.2068717398192474,"d":"1.2"},{"v":1.2461017811663866,"d":"1.2"},{"v":1.2791967242414357,"d":"1.3"},{"v":1.2994102694950873,"d":"1.3"},{"v":1.2951652758448358,"d":"1.3"},{"v":1.23403772793701,"d":"1.2"},{"v":1.2319113945865487,"d":"1.2"},{"v":579.3594848706585,"d":"57935.9%"},{"v":0.03199122333554315,"d":"3.2%"}]
["                         PFCs",{"v":0.11577667341186272,"d":"0.1"},{"v":0.13727346160182707,"d":"0.1"},{"v":0.11577667341186272,"d":"0.1"},{"v":0.14810676012777152,"d":"0.1"},{"v":0.15777672016393637,"d":"0.2"},{"v":0.15405574968489208,"d":"0.2"},{"v":0.08869558846071578,"d":"0.1"},{"v":0.11485314705973539,"d":"0.1"},{"v":0.11586000492254916,"d":"0.1"},{"v":0.1027457485790312,"d":"0.1"},{"v":0.09598786424995992,"d":"0.1"},{"v":0.09219848766856414,"d":"0.1"},{"v":0.0856661262148849,"d":"0.1"},{"v":0.08264312530516069,"d":"0.1"},{"v":0.07901263926755193,"d":"0.1"},{"v":0.07624150979922684,"d":"0.1"},{"v":0.08041752710744748,"d":"0.1"},{"v":0.0898329455943312,"d":"0.1"},{"v":0.09854776908382445,"d":"0.1"},{"v":0.1420077996787349,"d":"0.1"},{"v":0.1195490772024328,"d":"0.1"},{"v":0.1322111688988696,"d":"0.1"},{"v":-5.062292702957466E-3,"d":"-0.0"},{"v":-0.03687743168917136,"d":"-3.7%"},{"v":3.4274454791327486E-3,"d":"0.3%"}]
["                         SF6",{"v":0.03603194921477631,"d":"0.0"},{"v":0.04710413990419765,"d":"0.0"},{"v":0.03603194921477631,"d":"0.0"},{"v":0.04503596979565224,"d":"0.0"},{"v":0.054268710888859255,"d":"0.1"},{"v":0.05575155907299126,"d":"0.1"},{"v":0.05266430661866744,"d":"0.1"},{"v":0.053984891146559105,"d":"0.1"},{"v":0.05270411736246794,"d":"0.1"},{"v":0.05824301837539487,"d":"0.1"},{"v":0.06429553012640032,"d":"0.1"},{"v":0.04881716414985225,"d":"0.0"},{"v":0.04722772807000919,"d":"0.0"},{"v":0.04044724209956973,"d":"0.0"},{"v":0.037146970581111875,"d":"0.0"},{"v":0.03956957730806739,"d":"0.0"},{"v":0.037846917641331926,"d":"0.0"},{"v":0.03673528395357209,"d":"0.0"},{"v":0.032081324265154816,"d":"0.0"},{"v":0.0314863883400576,"d":"0.0"},{"v":0.03212342612555018,"d":"0.0"},{"v":0.03611193230062993,"d":"0.0"},{"v":-0.01099220760356772,"d":"-0.0"},{"v":-0.23335969250100155,"d":"-23.3%"},{"v":9.3616658968666115E-4,"d":"0.1%"}]
["                         NF3",{"v":0.000500835822402898,"d":"0.0"},{"v":0.000203353200600544,"d":"0.0"},{"v":0.000500835822402898,"d":"0.0"},{"v":0.000660147523877406,"d":"0.0"},{"v":0.000759169652459016,"d":"0.0"},{"v":0.000883983920434688,"d":"0.0"},{"v":0.00054126746709938,"d":"0.0"},{"v":0.0007231382928,"d":"0.0"},{"v":0.00066812595643135,"d":"0.0"},{"v":0.000412266054869747,"d":"0.0"},{"v":2.0207115444095E-4,"d":"0.0"},{"v":2.0036818419339201E-4,"d":"0.0"},{"v":1.96303908351915E-4,"d":"0.0"},{"v":1.89423095500207E-4,"d":"0.0"},{"v":1.7920308099463899E-4,"d":"0.0"},{"v":1.90561764227207E-4,"d":"0.0"},{"v":0.000209617940649928,"d":"0.0"},{"v":2.30579734714921E-4,"d":"0.0"},{"v":0.000253637708186413,"d":"0.0"},{"v":0.000279001479005054,"d":"0.0"},{"v":0.00030690162690556,"d":"0.0"},{"v":0.000337591789596116,"d":"0.0"},{"v":1.3423858899557203E-4,"d":"0.0"},{"v":0.6601252825091405,"d":"66.0%"},{"v":8.751737562570138E-6,"d":"0.0%"}]
[]
["*HFCs are hydrofluorocarbons"]
["  PFCs are perfluorocarbons"]
["  SF6 is sulphur hexafluoride"]
["  NF3 is nitrogen trifluoride"]

{"sheet":"Chart B9 data","index":23,"n_rows":72,"n_cols":29,"rows_kept":72}
["Carbon dioxide (CO2) emissions - by Scottish Government sector, Baseline Period, 1990 to 2016. Values in MtCO2e"]
[]
[null,"Baseline Period","1990",1991,1992,1993,1994,"1995",1996,1997,"1998","1999","2000","2001","2002","2003","2004","2005","2006","2007","2008","2009","2010","2011","2012",2013,2014,2015,2016]
["CO2",{"v":57.366237515418746,"d":"57.4"},{"v":57.366237515418746,"d":"57.4"},{"$nulls":4},{"v":57.570541214906754,"d":"57.6"},null,null,{"v":56.286632424720736,"d":"56.3"},{"v":53.750988492145716,"d":"53.8"},{"v":55.140733989492894,"d":"55.1"},{"v":54.95264870391018,"d":"55.0"},{"v":51.21824905208141,"d":"51.2"},{"v":50.99045835814875,"d":"51.0"},{"v":49.15010139483756,"d":"49.2"},{"v":47.5187133021532,"d":"47.5"},{"v":50.3573261821287,"d":"50.4"},{"v":46.372124334447975,"d":"46.4"},{"v":45.539644394873946,"d":"45.5"},{"v":41.44370256187451,"d":"41.4"},{"v":43.210370088611995,"d":"43.2"},{"v":36.86650614927568,"d":"36.9"},{"v":39.52089847463979,"d":"39.5"},{"v":37.17383202765312,"d":"37.2"},{"v":33.04685798872936,"d":"33.0"},{"v":31.522487103386435,"d":"31.5"},{"v":27.338048419571727,"d":"27.3"}]
["Energy Supply",{"v":20.649747214947347,"d":"20.6"},{"v":20.649747214947347,"d":"20.6"},{"$nulls":4},{"v":24.78294943340376,"d":"24.8"},null,null,{"v":24.194741656287388,"d":"24.2"},{"v":22.168607285971373,"d":"22.2"},{"v":25.092486167577487,"d":"25.1"},{"v":24.34133271636256,"d":"24.3"},{"v":22.650956075796866,"d":"22.7"},{"v":22.962948425949712,"d":"23.0"},{"v":21.172671054286127,"d":"21.2"},{"v":20.0218398840273,"d":"20.0"},{"v":23.943401060324366,"d":"23.9"},{"v":20.714244245287933,"d":"20.7"},{"v":19.400068762086573,"d":"19.4"},{"v":18.037922439928277,"d":"18.0"},{"v":20.229657644614115,"d":"20.2"},{"v":16.35996103626578,"d":"16.4"},{"v":16.806406265748294,"d":"16.8"},{"v":15.38398452454039,"d":"15.4"},{"v":13.306350312794624,"d":"13.3"},{"v":11.688201739499089,"d":"11.7"},{"v":6.693240782927276,"d":"6.7"}]
["Transport (including international aviation and shipping)",{"$f":"B7+B8","v":{"v":14.476511850165661,"d":"14.5"}},{"$f":"C7+C8","v":{"v":14.476511850165661,"d":"14.5"}},{"$nulls":4},{"$f":"H7+H8","v":{"v":15.398922595713136,"d":"15.4"}},null,null,{"$f":"K7+K8","v":{"v":16.07247684634114,"d":"16.1"}},{"v":16.007550706498172,"d":"16.0"},{"v":15.321109732643874,"d":"15.3"},{"v":15.182025902935411,"d":"15.2"},{"v":15.545715661250124,"d":"15.5"},{"v":15.340505445894584,"d":"15.3"},{"v":15.451379543576692,"d":"15.5"},{"v":15.635946400794497,"d":"15.6"},{"v":15.630692861306954,"d":"15.6"},{"v":15.948016912690392,"d":"15.9"},{"v":15.368976412929028,"d":"15.4"},{"v":14.70065930839575,"d":"14.7"},{"v":14.18713107158754,"d":"14.2"},{"v":13.775912505259978,"d":"13.8"},{"v":13.52555246588597,"d":"13.5"},{"v":13.410845165814148,"d":"13.4"},{"v":13.612500314731077,"d":"13.6"},{"v":13.919706279380492,"d":"13.9"},{"v":14.233557440145951,"d":"14.2"}]
["          Transport (excluding international aviation and shipping)",{"v":13.192114873910459,"d":"13.2"},{"v":13.192114873910459,"d":"13.2"},{"$nulls":4},{"v":13.944275155738234,"d":"13.9"},null,null,{"v":14.363032839114517,"d":"14.4"},{"v":14.463245945675004,"d":"14.5"},{"v":13.927577755293566,"d":"13.9"},{"v":13.667621557630493,"d":"13.7"},{"v":14.186394969214073,"d":"14.2"},{"v":14.040426611070762,"d":"14.0"},{"v":13.976627612035632,"d":"14.0"},{"v":14.052691158728766,"d":"14.1"},{"v":13.961426086303394,"d":"14.0"},{"v":14.22868156172603,"d":"14.2"},{"v":13.61638855100115,"d":"13.6"},{"v":13.094495663789967,"d":"13.1"},{"v":12.77700461309245,"d":"12.8"},{"v":12.245402820815888,"d":"12.2"},{"v":12.085746986814293,"d":"12.1"},{"v":11.896002877533315,"d":"11.9"},{"v":12.015275434803097,"d":"12.0"},{"v":12.23909404323316,"d":"12.2"},{"v":12.434538965303158,"d":"12.4"}]
["          International Aviation and Shipping",{"v":1.2843969762552025,"d":"1.3"},{"v":1.2843969762552025,"d":"1.3"},{"$nulls":4},{"v":1.454647439974903,"d":"1.5"},null,null,{"v":1.7094440072266233,"d":"1.7"},{"v":1.544304760823169,"d":"1.5"},{"v":1.393531977350308,"d":"1.4"},{"v":1.5144043453049172,"d":"1.5"},{"v":1.359320692036051,"d":"1.4"},{"v":1.3000788348238224,"d":"1.3"},{"v":1.4747519315410607,"d":"1.5"},{"v":1.5832552420657302,"d":"1.6"},{"v":1.6692667750035601,"d":"1.7"},{"v":1.719335350964363,"d":"1.7"},{"v":1.7525878619278779,"d":"1.8"},{"v":1.6061636446057823,"d":"1.6"},{"v":1.410126458495091,"d":"1.4"},{"v":1.5305096844440889,"d":"1.5"},{"v":1.4398054790716757,"d":"1.4"},{"v":1.5148422882808341,"d":"1.5"},{"v":1.5972248799279798,"d":"1.6"},{"v":1.6806122361473317,"d":"1.7"},{"v":1.799018474842792,"d":"1.8"}]
["Business and Industrial Process",{"v":13.655446272356228,"d":"13.7"},{"v":13.655446272356228,"d":"13.7"},{"$nulls":4},{"v":10.8027269882271,"d":"10.8"},null,null,{"v":10.596138289179184,"d":"10.6"},{"v":10.734055536223467,"d":"10.7"},{"v":10.561916664410765,"d":"10.6"},{"v":10.845628862942508,"d":"10.8"},{"v":9.905883211225662,"d":"9.9"},{"v":10.015183588826533,"d":"10.0"},{"v":9.872377669876677,"d":"9.9"},{"v":9.418220717807728,"d":"9.4"},{"v":9.084701934534984,"d":"9.1"},{"v":8.66597897742202,"d":"8.7"},{"v":9.128547872658851,"d":"9.1"},{"v":7.8503552210369385,"d":"7.9"},{"v":8.002278321651795,"d":"8.0"},{"v":7.813825569855084,"d":"7.8"},{"v":7.637662905624443,"d":"7.6"},{"v":7.790395897723995,"d":"7.8"},{"v":7.210404547921621,"d":"7.2"},{"v":7.2321651638200235,"d":"7.2"},{"v":7.176779917915407,"d":"7.2"}]
["Residential",{"v":7.729799989208748,"d":"7.7"},{"v":7.729799989208748,"d":"7.7"},{"$nulls":4},{"v":7.632152355134738,"d":"7.6"},null,null,{"v":7.752522450523114,"d":"7.8"},{"v":7.671053061201941,"d":"7.7"},{"v":7.536533837257553,"d":"7.5"},{"v":8.021684348620171,"d":"8.0"},{"v":7.354170297489405,"d":"7.4"},{"v":7.338949662298157,"d":"7.3"},{"v":7.506565320105067,"d":"7.5"},{"v":7.433563262400808,"d":"7.4"},{"v":7.231469724604159,"d":"7.2"},{"v":7.012896456808053,"d":"7.0"},{"v":7.210651530392599,"d":"7.2"},{"v":6.927660189275512,"d":"6.9"},{"v":7.761243792457854,"d":"7.8"},{"v":6.249956262735024,"d":"6.2"},{"v":6.784309223754839,"d":"6.8"},{"v":6.822327418564533,"d":"6.8"},{"v":5.706699561418046,"d":"5.7"},{"v":5.879571979024938,"d":"5.9"},{"v":6.087586426915985,"d":"6.1"}]
["Agriculture and Related Land Use",{"v":5.342887750395262,"d":"5.3"},{"v":5.342887750395262,"d":"5.3"},{"$nulls":4},{"v":5.505302070876662,"d":"5.5"},null,null,{"v":5.233529392692489,"d":"5.2"},{"v":5.239028758044895,"d":"5.2"},{"v":5.2451221388600775,"d":"5.2"},{"v":5.061369231047017,"d":"5.1"},{"v":4.764490278167195,"d":"4.8"},{"v":4.861046090591016,"d":"4.9"},{"v":4.542592662423936,"d":"4.5"},{"v":4.358730873892931,"d":"4.4"},{"v":4.212068599912625,"d":"4.2"},{"v":4.244737533772384,"d":"4.2"},{"v":3.89851325290182,"d":"3.9"},{"v":3.8325638358340415,"d":"3.8"},{"v":3.7487507425119735,"d":"3.7"},{"v":3.3995146074423843,"d":"3.4"},{"v":3.237315671633261,"d":"3.2"},{"v":3.2728388308661844,"d":"3.3"},{"v":3.2384049097055727,"d":"3.2"},{"v":2.9896550290780306,"d":"3.0"},{"v":2.9391660310612324,"d":"2.9"}]
["Other sources *",{"$f":"B13+B14+B15","v":{"v":3.4706792569852465,"d":"3.5"}},{"$f":"C13+C14+C15","v":{"v":3.4706792569852465,"d":"3.5"}},{"$nulls":4},{"$f":"H13+H14+H15","v":{"v":3.5541643563174383,"d":"3.6"}},null,null,{"$f":"K13+K14+K15","v":{"v":3.498920767134253,"d":"3.5"}},{"v":3.4887712085932865,"d":"3.5"},{"v":3.367060340427564,"d":"3.4"},{"v":3.393538666600838,"d":"3.4"},{"v":3.165170589314787,"d":"3.2"},{"v":3.2169637731622807,"d":"3.2"},{"v":3.4158441245567333,"d":"3.4"},{"v":3.3634984179339793,"d":"3.4"},{"v":3.062350076835153,"d":"3.1"},{"v":3.002751307296659,"d":"3.0"},{"v":3.0548355831795666,"d":"3.1"},{"v":2.9219757373286956,"d":"2.9"},{"v":3.065114380627662,"d":"3.1"},{"v":2.8297418134974093,"d":"2.8"},{"v":2.9459251920751557,"d":"2.9"},{"v":2.982985370473811,"d":"3.0"},{"v":2.76223472801163,"d":"2.8"},{"v":2.792094714099969,"d":"2.8"},{"v":2.9571941384301894,"d":"3.0"}]
["         Public Sector Buildings",{"v":1.680895293380977,"d":"1.7"},{"v":1.680895293380977,"d":"1.7"},{"$nulls":4},{"v":1.8003191470284299,"d":"1.8"},null,null,{"v":1.7650548989076784,"d":"1.8"},{"v":1.7433617935228094,"d":"1.7"},{"v":1.6402863275527095,"d":"1.6"},{"v":1.6785255569768016,"d":"1.7"},{"v":1.4286505850457214,"d":"1.4"},{"v":1.423757612893709,"d":"1.4"},{"v":1.5488404113839367,"d":"1.5"},{"v":1.5228486459117816,"d":"1.5"},{"v":1.3752736426096956,"d":"1.4"},{"v":1.2763057856564626,"d":"1.3"},{"v":1.3285165176519276,"d":"1.3"},{"v":1.1915346573333943,"d":"1.2"},{"v":1.2733822676189364,"d":"1.3"},{"v":1.0539140731610401,"d":"1.1"},{"v":1.1904016416059882,"d":"1.2"},{"v":1.195420657473798,"d":"1.2"},{"v":1.020102324796641,"d":"1.0"},{"v":1.0575917572448812,"d":"1.1"},{"v":1.0778365952905966,"d":"1.1"}]
["        Waste Management",{"v":0.0467719765891562,"d":"0.0"},{"v":0.0467719765891562,"d":"0.0"},{"$nulls":4},{"v":0.03067162395778749,"d":"0.0"},null,null,{"v":0.018031844856776398,"d":"0.0"},{"v":0.0184057650657329,"d":"0.0"},{"v":0.018763836837278797,"d":"0.0"},{"v":0.0191489502968049,"d":"0.0"},{"v":0.0195247558775522,"d":"0.0"},{"v":0.0165168300564474,"d":"0.0"},{"v":0.0135590388933758,"d":"0.0"},{"v":0.0106087255759124,"d":"0.0"},{"v":0.00767565321425208,"d":"0.0"},{"v":0.00816972889770399,"d":"0.0"},{"v":0.00838917531626008,"d":"0.0"},{"v":0.00889262349725065,"d":"0.0"},{"v":0.00833981833201349,"d":"0.0"},{"v":0.00780315666828896,"d":"0.0"},{"v":0.00772209495142481,"d":"0.0"},{"v":0.00734377079830977,"d":"0.0"},{"v":0.00749143418853079,"d":"0.0"},{"v":6.9092708655762594E-3,"d":"0.0"},{"v":0.00680758384182209,"d":"0.0"}]
["        Development",{"v":1.7430119870151133,"d":"1.7"},{"v":1.7430119870151133,"d":"1.7"},{"$nulls":4},{"v":1.723173585331221,"d":"1.7"},null,null,{"v":1.7158340233697982,"d":"1.7"},{"v":1.727003650004744,"d":"1.7"},{"v":1.7080101760375752,"d":"1.7"},{"v":1.6958641593272317,"d":"1.7"},{"v":1.7169952483915136,"d":"1.7"},{"v":1.776689330212124,"d":"1.8"},{"v":1.8534446742794208,"d":"1.9"},{"v":1.8300410464462853,"d":"1.8"},{"v":1.6794007810112053,"d":"1.7"},{"v":1.7182757927424923,"d":"1.7"},{"v":1.7179298902113787,"d":"1.7"},{"v":1.7215484564980505,"d":"1.7"},{"v":1.7833922946767125,"d":"1.8"},{"v":1.7680245836680801,"d":"1.8"},{"v":1.747801455517743,"d":"1.7"},{"v":1.780220942201703,"d":"1.8"},{"v":1.734640969026458,"d":"1.7"},{"v":1.7275936859895114,"d":"1.7"},{"v":1.8725499592977708,"d":"1.9"}]
["Forestry",{"v":-7.958834818639747,"d":"-8.0"},{"v":-7.958834818639747,"d":"-8.0"},{"$nulls":4},{"v":-10.105676584766089,"d":"-10.1"},null,null,{"v":-11.061696977436837,"d":"-11.1"},{"v":-11.558078064387425,"d":"-11.6"},{"v":-11.983494891684419,"d":"-12.0"},{"v":-11.892931024598328,"d":"-11.9"},{"v":-12.168137061162628,"d":"-12.2"},{"v":-12.74513862857353,"d":"-12.7"},{"v":-12.811328979987673,"d":"-12.8"},{"v":-12.713086254704042,"d":"-12.7"},{"v":-12.80735807538954,"d":"-12.8"},{"v":-13.216501098829468,"d":"-13.2"},{"v":-12.521949019274489,"d":"-12.5"},{"v":-12.827434169924711,"d":"-12.8"},{"v":-13.783805864838948,"d":"-13.8"},{"v":-13.562405645779984,"d":"-13.6"},{"v":-11.416273250082165,"d":"-11.4"},{"v":-12.489545180329943,"d":"-12.5"},{"v":-12.789736385853217,"d":"-12.8"},{"v":-12.978907801516105,"d":"-13.0"},{"v":-12.749476317824312,"d":"-12.7"}]
{"$rows_empty":55}
["Grand Total",75687.84905878555,75595.83089082137,75552.67192997548,74152.35157475478,70903.28943181304,71990.4628448769,71312.10533764727,67026.7508735699,66615.94878909974,64123.29630248781,62112.22629669462,64325.63724290604,59945.75662426824,58643.893378429166,54217.4674069008,55823.19624969453,49162.92195117134,51456.86810014969,48394.27905313575,44359.47734327684,43005.815931380486,38574.25878947118,null,null,1342982.3554013106]

{"sheet":"Chart B10 data","index":25,"n_rows":15,"n_cols":30,"rows_kept":15}
["Methane (CH4) emissions by Scottish Government sector, 1990 to 2016.  Values in MtCO2e"]
[]
[null,"Baseline Period","1990",1991,1992,1993,1994,"1995",1996,1997,"1998","1999","2000","2001","2002","2003","2004","2005","2006","2007","2008","2009","2010","2011","2012",2013,2014,2015,2016,"% reduction 1990 to 2016"]
["CH4",{"v":13.455417549970942,"d":"13.5"},{"v":13.455417549970942,"d":"13.5"},{"$nulls":4},{"v":13.335744667051534,"d":"13.3"},null,null,{"v":12.87959324557911,"d":"12.9"},{"v":12.16670075872162,"d":"12.2"},{"v":11.940983548319469,"d":"11.9"},{"v":11.39834469325266,"d":"11.4"},{"v":10.833708741880113,"d":"10.8"},{"v":10.572310506397564,"d":"10.6"},{"v":9.978807630637162,"d":"10.0"},{"v":9.630142819130704,"d":"9.6"},{"v":9.027111315926295,"d":"9.0"},{"v":8.655056599279854,"d":"8.7"},{"v":8.275267728136406,"d":"8.3"},{"v":7.8409299490181175,"d":"7.8"},{"v":7.648466299717204,"d":"7.6"},{"v":7.524407214699668,"d":"7.5"},{"v":7.088645893919206,"d":"7.1"},{"v":6.328824737438187,"d":"6.3"},{"v":6.3494287082532175,"d":"6.3"},{"v":6.597838363379637,"d":"6.6"},{"v":6.45143767119241,"d":"6.5"},{"$f":"(AC4-B4)/B4","v":{"v":-0.5205323322570289,"d":"-52%"}}]
["Waste Management",{"v":5.911867896785922,"d":"5.9"},{"v":5.911867896785922,"d":"5.9"},{"$nulls":4},{"v":6.129063466996215,"d":"6.1"},null,null,{"v":5.979046231914224,"d":"6.0"},{"v":5.746539724844562,"d":"5.7"},{"v":5.6188556168052255,"d":"5.6"},{"v":5.283905336862478,"d":"5.3"},{"v":5.095022404929092,"d":"5.1"},{"v":4.9692407400749365,"d":"5.0"},{"v":4.346675932639945,"d":"4.3"},{"v":3.9427151956188,"d":"3.9"},{"v":3.52788570579146,"d":"3.5"},{"v":3.1471063149480005,"d":"3.1"},{"v":2.999090144386965,"d":"3.0"},{"v":2.6696461337343416,"d":"2.7"},{"v":2.4249486182454567,"d":"2.4"},{"v":2.286105472324207,"d":"2.3"},{"v":1.9399500798199807,"d":"1.9"},{"v":1.3380172954758958,"d":"1.3"},{"v":1.352902242920797,"d":"1.4"},{"v":1.6085787487966232,"d":"1.6"},{"v":1.52204700097393,"d":"1.5"},{"$f":"(AC5-B5)/B5","v":{"v":-0.7425438072116912,"d":"-74%"}}]
["Agriculture and Related Land Use",{"v":5.2093585412921595,"d":"5.2"},{"v":5.2093585412921595,"d":"5.2"},{"$nulls":4},{"v":5.118794554352787,"d":"5.1"},null,null,{"v":5.226327396732024,"d":"5.2"},{"v":5.136922931917325,"d":"5.1"},{"v":5.097808175428852,"d":"5.1"},{"v":4.8106901803265405,"d":"4.8"},{"v":4.828455821871248,"d":"4.8"},{"v":4.846194310268009,"d":"4.8"},{"v":4.86180727981649,"d":"4.9"},{"v":4.922576301527821,"d":"4.9"},{"v":4.795564108151083,"d":"4.8"},{"v":4.804387874916734,"d":"4.8"},{"v":4.583142910070853,"d":"4.6"},{"v":4.516369861309419,"d":"4.5"},{"v":4.567209282845604,"d":"4.6"},{"v":4.565821071815919,"d":"4.6"},{"v":4.520901472002992,"d":"4.5"},{"v":4.380401954251474,"d":"4.4"},{"v":4.427021911805816,"d":"4.4"},{"v":4.452173502504266,"d":"4.5"},{"v":4.423060196238321,"d":"4.4"},{"v":-0.1509395713159725,"d":"-15%"}]
["Energy Supply",{"v":1.9701809409374667,"d":"2.0"},{"v":1.9701809409374667,"d":"2.0"},{"$nulls":4},{"v":1.850306798398577,"d":"1.9"},null,null,{"v":1.4750963915323956,"d":"1.5"},{"v":1.085730710922189,"d":"1.1"},{"v":1.0495000064455051,"d":"1.0"},{"v":1.13234918327031,"d":"1.1"},{"v":0.7560647502339021,"d":"0.8"},{"v":0.6186802899124525,"d":"0.6"},{"v":0.6410016537316993,"d":"0.6"},{"v":0.6369229305436098,"d":"0.6"},{"v":0.5873289098694541,"d":"0.6"},{"v":0.585894065684782,"d":"0.6"},{"v":0.5746316950330673,"d":"0.6"},{"v":0.5476528177095265,"d":"0.5"},{"v":0.5437785657112786,"d":"0.5"},{"v":0.5687367764385824,"d":"0.6"},{"v":0.5085620110381963,"d":"0.5"},{"v":0.4852318313222032,"d":"0.5"},{"v":0.4609645338301365,"d":"0.5"},{"v":0.4389627694396188,"d":"0.4"},{"v":0.4025266262033228,"d":"0.4"},{"v":-0.7956905288040247,"d":"-80%"}]
["Other sources *",{"$f":"SUM(B9:B15)","v":{"v":0.3640101709553943,"d":"0.4"}},{"$f":"SUM(C9:C15)","v":{"v":0.3640101709553943,"d":"0.4"}},{"$nulls":4},{"$f":"SUM(H9:H15)","v":{"v":0.23757984730395587,"d":"0.2"}},null,null,{"$f":"SUM(K9:K15)","v":{"v":0.1991232254004673,"d":"0.2"}},{"v":0.19750739103754333,"d":"0.2"},{"v":0.1748197496398889,"d":"0.2"},{"v":0.1713999927933323,"d":"0.2"},{"v":0.1541657648458687,"d":"0.2"},{"v":0.13819516614216543,"d":"0.1"},{"v":0.12932276444902593,"d":"0.1"},{"v":0.12792839144047163,"d":"0.1"},{"v":0.11633259211429836,"d":"0.1"},{"v":0.11766834373033931,"d":"0.1"},{"v":0.11840297864552012,"d":"0.1"},{"v":0.10726113626483003,"d":"0.1"},{"v":0.11252983291486443,"d":"0.1"},{"v":0.10374389412096073,"d":"0.1"},{"v":0.11923233105803875,"d":"0.1"},{"$f":"SUM(Z9:Z15)","v":{"v":0.12517365638861394,"d":"0.1"}},{"$f":"SUM(AA9:AA15)","v":{"v":0.10854001969646881,"d":"0.1"}},{"$f":"SUM(AB9:AB15)","v":{"v":0.0981233426391284,"d":"0.1"}},{"$f":"SUM(AC9:AC15)","v":{"v":0.10380384777683552,"d":"0.1"}},{"v":-0.7148325622210275,"d":"-71%"}]
["       Residential",{"v":0.23100615470695407,"d":"0.2"},{"v":0.23100615470695407,"d":"0.2"},{"$nulls":4},{"v":0.12815970848521027,"d":"0.1"},null,null,{"v":0.11320578487631192,"d":"0.1"},{"v":0.11546159397180684,"d":"0.1"},{"v":0.09636487210569226,"d":"0.1"},{"v":0.09582631888944287,"d":"0.1"},{"v":0.07676995502915171,"d":"0.1"},{"v":0.06875603198610025,"d":"0.1"},{"v":0.06464420911802676,"d":"0.1"},{"v":0.05786472286457378,"d":"0.1"},{"v":0.0564064712937551,"d":"0.1"},{"v":0.05791332981460443,"d":"0.1"},{"v":0.06344556733881958,"d":"0.1"},{"v":0.0635035849232292,"d":"0.1"},{"v":0.07260176148479693,"d":"0.1"},{"v":0.06486814610027203,"d":"0.1"},{"v":0.0696544341460338,"d":"0.1"},{"v":0.07410467121005498,"d":"0.1"},{"v":0.06658371209524205,"d":"0.1"},{"v":0.07027916902157559,"d":"0.1"},{"v":0.0709054833170069,"d":"0.1"},{"v":-0.6930580338564788,"d":"-69%"}]
["       Transport (excluding international aviation and shipping)",{"v":0.09985422798021923,"d":"0.1"},{"v":0.09985422798021923,"d":"0.1"},{"$nulls":4},{"v":0.07399985770815651,"d":"0.1"},null,null,{"v":0.05867807770328819,"d":"0.1"},{"v":0.053961248342574396,"d":"0.1"},{"v":0.048708423104585744,"d":"0.0"},{"v":0.042762896288700405,"d":"0.0"},{"v":0.03913904146086365,"d":"0.0"},{"v":0.03478329457537963,"d":"0.0"},{"v":0.031443855190529675,"d":"0.0"},{"v":0.028974641837877,"d":"0.0"},{"v":0.026676254824791853,"d":"0.0"},{"v":0.02403534718962029,"d":"0.0"},{"v":0.02165934126230004,"d":"0.0"},{"v":0.016322771325215476,"d":"0.0"},{"v":0.014509228330331208,"d":"0.0"},{"v":0.0130283202392438,"d":"0.0"},{"v":0.011718947727720886,"d":"0.0"},{"v":0.010437776341579207,"d":"0.0"},{"v":9.892130283520803E-3,"d":"0.0"},{"v":0.009268342793636362,"d":"0.0"},{"v":0.008783352726915343,"d":"0.0"},{"v":-0.9120382491099396,"d":"-91%"}]
["       International Aviation and Shipping",{"v":1.1069395935721954E-3,"d":"0.0"},{"v":1.1069395935721954E-3,"d":"0.0"},{"$nulls":4},{"v":7.6442123456878653E-4,"d":"0.0"},null,null,{"v":7.9104546446214787E-4,"d":"0.0"},{"v":6.4998032589499749E-4,"d":"0.0"},{"v":6.0779408813911465E-4,"d":"0.0"},{"v":5.6189213425343089E-4,"d":"0.0"},{"v":5.2015826260615324E-4,"d":"0.0"},{"v":4.5773434821944124E-4,"d":"0.0"},{"v":4.6519930802503122E-4,"d":"0.0"},{"v":4.8075480477165043E-4,"d":"0.0"},{"v":5.080763441677222E-4,"d":"0.0"},{"v":5.1752353406965882E-4,"d":"0.0"},{"v":0.000537226334848467,"d":"0.0"},{"v":4.742064568761526E-4,"d":"0.0"},{"v":4.0031222065874963E-4,"d":"0.0"},{"v":4.311508165151033E-4,"d":"0.0"},{"v":3.6887409081263057E-4,"d":"0.0"},{"v":3.3351456329377114E-4,"d":"0.0"},{"v":3.4178559655088074E-4,"d":"0.0"},{"v":2.5484376166140597E-4,"d":"0.0"},{"v":2.2641942182220648E-4,"d":"0.0"},{"v":-0.7954545820413468,"d":"-80%"}]
["       Business and Industrial process",{"v":0.026432903433377297,"d":"0.0"},{"v":0.026432903433377297,"d":"0.0"},{"$nulls":4},{"v":0.02350954784328612,"d":"0.0"},null,null,{"v":0.01910385706225895,"d":"0.0"},{"v":0.02185763947268649,"d":"0.0"},{"v":0.023181959306942005,"d":"0.0"},{"v":0.026180847980201285,"d":"0.0"},{"v":0.03196927971725564,"d":"0.0"},{"v":0.026623551602392433,"d":"0.0"},{"v":0.02270992616927705,"d":"0.0"},{"v":0.029241806818140346,"d":"0.0"},{"v":0.02538950656263502,"d":"0.0"},{"v":0.02758018190955466,"d":"0.0"},{"v":0.02509970043423951,"d":"0.0"},{"v":0.019912676070087433,"d":"0.0"},{"v":0.018740465528530256,"d":"0.0"},{"v":0.017542974268134205,"d":"0.0"},{"v":0.02918600038846229,"d":"0.0"},{"v":0.02943458725616352,"d":"0.0"},{"v":0.026414811272477606,"d":"0.0"},{"v":0.013867995714304072,"d":"0.0"},{"v":0.015424989013829554,"d":"0.0"},{"v":-0.4164474193042242,"d":"-42%"}]
["       Public Sector Buildings",{"v":0.00442391994216957,"d":"0.0"},{"v":0.00442391994216957,"d":"0.0"},{"$nulls":4},{"v":0.00456855232594332,"d":"0.0"},null,null,{"v":0.004255668118239862,"d":"0.0"},{"v":0.00415896814687292,"d":"0.0"},{"v":3.8503981434454015E-3,"d":"0.0"},{"v":0.003925003298429272,"d":"0.0"},{"v":3.2545117773848764E-3,"d":"0.0"},{"v":0.003209701601217234,"d":"0.0"},{"v":3.4567752090157375E-3,"d":"0.0"},{"v":3.4301348649983182E-3,"d":"0.0"},{"v":3.0941293804468474E-3,"d":"0.0"},{"v":2.8783473426513633E-3,"d":"0.0"},{"v":2.9909584387548508E-3,"d":"0.0"},{"v":2.6698750381737952E-3,"d":"0.0"},{"v":2.8492543607603156E-3,"d":"0.0"},{"v":0.002377872847499441,"d":"0.0"},{"v":2.6636750010233193E-3,"d":"0.0"},{"v":0.002658273203737639,"d":"0.0"},{"v":2.2804176116614245E-3,"d":"0.0"},{"v":0.002368640091711216,"d":"0.0"},{"v":2.4087052943935414E-3,"d":"0.0"},{"v":-0.45552692501657954,"d":"-46%"}]
["       Development",{"v":0.000428161302615996,"d":"0.0"},{"v":0.000428161302615996,"d":"0.0"},{"$nulls":4},{"v":5.65694776733229E-4,"d":"0.0"},null,null,{"v":0.000657024174370233,"d":"0.0"},{"v":0.00104321562158587,"d":"0.0"},{"v":6.4694313434161994E-4,"d":"0.0"},{"v":0.000422597778467085,"d":"0.0"},{"v":1.09478089483738E-3,"d":"0.0"},{"v":0.00280799829907354,"d":"0.0"},{"v":0.004977906401193459,"d":"0.0"},{"v":4.4160577238601196E-3,"d":"0.0"},{"v":3.8632413917971697E-4,"d":"0.0"},{"v":1.5065495113772101E-3,"d":"0.0"},{"v":1.55433445864349E-3,"d":"0.0"},{"v":1.7049732042874399E-3,"d":"0.0"},{"v":0.00342881098978696,"d":"0.0"},{"v":0.00305127315077881,"d":"0.0"},{"v":0.00253851775787765,"d":"0.0"},{"v":3.4550081286399397E-3,"d":"0.0"},{"v":2.24678744283605E-3,"d":"0.0"},{"v":0.00208435125623976,"d":"0.0"},{"v":0.00605489800286799,"d":"0.0"},{"$f":"(AC14-B14)/B14","v":{"v":13.141628320620166,"d":"1314%"}}]
["       Forestry",{"v":7.5786399648591993E-4,"d":"0.0"},{"v":7.5786399648591993E-4,"d":"0.0"},{"$nulls":4},{"v":0.00601206493005759,"d":"0.0"},null,null,{"v":2.43176800153602E-3,"d":"0.0"},{"v":0.000374745156121818,"d":"0.0"},{"v":1.4593597567427502E-3,"d":"0.0"},{"v":1.7204364238379499E-3,"d":"0.0"},{"v":1.4180377037692699E-3,"d":"0.0"},{"v":1.5568537297829099E-3,"d":"0.0"},{"v":0.00162489305295822,"d":"0.0"},{"v":3.52027252625042E-3,"d":"0.0"},{"v":3.8718295693221097E-3,"d":"0.0"},{"v":0.00323706442846168,"d":"0.0"},{"v":3.1158503779141703E-3,"d":"0.0"},{"v":2.67304924696051E-3,"d":"0.0"},{"v":0,"d":"0.0"},{"v":0.00244415669851736,"d":"0.0"},{"v":3.10188194610817E-3,"d":"0.0"},{"v":0.00474982568514488,"d":"0.0"},{"v":0.000780375394180013,"d":"0.0"},{"v":0,"d":"0.0"},{"v":0,"d":"0.0"},{"v":-1,"d":"-100%"}]

{"sheet":"Chart B11 data","index":27,"n_rows":15,"n_cols":29,"rows_kept":15}
["Nitrous oxide (N2O) emissions by Scottish Government sector, 1990 to 2016.  Values in MtCO2e"]
[]
[null,"Baseline Period","1990",1991,1992,1993,1994,"1995",1996,1997,"1998","1999","2000","2001","2002","2003","2004","2005","2006","2007","2008","2009","2010","2011","2012",2013,2014,2015,2016]
["N2O",{"v":4.587468537374583,"d":"4.6"},{"v":4.587468537374583,"d":"4.6"},{"$nulls":4},{"v":4.367660591995923,"d":"4.4"},null,null,{"v":4.391087204378035,"d":"4.4"},{"v":4.337138188263675,"d":"4.3"},{"v":4.162450940129313,"d":"4.2"},{"v":4.181661821198981,"d":"4.2"},{"v":4.09178368103003,"d":"4.1"},{"v":4.049809264421719,"d":"4.0"},{"v":3.90885164392061,"d":"3.9"},{"v":3.777789559359876,"d":"3.8"},{"v":3.6885040646176654,"d":"3.7"},{"v":3.6175175776176136,"d":"3.6"},{"v":3.4961236834022382,"d":"3.5"},{"v":3.5356407935138705,"d":"3.5"},{"v":3.521595089172296,"d":"3.5"},{"v":3.4466627846872933,"d":"3.4"},{"v":3.474423141141681,"d":"3.5"},{"v":3.481542832745846,"d":"3.5"},{"v":3.4900071873013774,"d":"3.5"},{"v":3.4383457838146865,"d":"3.4"},{"v":3.3820742777809203,"d":"3.4"}]
["Agriculture and Related Land Use",{"v":3.365360846806335,"d":"3.4"},{"v":3.365360846806335,"d":"3.4"},{"$nulls":4},{"v":3.5092890090456126,"d":"3.5"},null,null,{"v":3.5645414302335756,"d":"3.6"},{"v":3.535550061267387,"d":"3.5"},{"v":3.3341368686232804,"d":"3.3"},{"v":3.3600511842282383,"d":"3.4"},{"v":3.289244788815657,"d":"3.3"},{"v":3.2639940139824133,"d":"3.3"},{"v":3.1325722274608894,"d":"3.1"},{"v":3.0046514776332245,"d":"3.0"},{"v":2.910787449675593,"d":"2.9"},{"v":2.855099566706378,"d":"2.9"},{"v":2.7606496463751506,"d":"2.8"},{"v":2.8256016481195876,"d":"2.8"},{"v":2.7996884557292736,"d":"2.8"},{"v":2.747945345471894,"d":"2.7"},{"v":2.7558576127083154,"d":"2.8"},{"v":2.7756583622838273,"d":"2.8"},{"v":2.7804437829059587,"d":"2.8"},{"v":2.7190737852275,"d":"2.7"},{"v":2.6868266340856684,"d":"2.7"}]
["Business and Industrial Process",{"v":0.5300921952887068,"d":"0.5"},{"v":0.5300921952887068,"d":"0.5"},{"$nulls":4},{"v":0.13663133361831956,"d":"0.1"},null,null,{"v":0.13203423350394705,"d":"0.1"},{"v":0.13151519716209886,"d":"0.1"},{"v":0.1297559251708603,"d":"0.1"},{"v":0.13215689256480398,"d":"0.1"},{"v":0.13104685162351193,"d":"0.1"},{"v":0.13139159258218866,"d":"0.1"},{"v":0.1359669236516494,"d":"0.1"},{"v":0.1336979746520375,"d":"0.1"},{"v":0.135086797544165,"d":"0.1"},{"v":0.13594322720013166,"d":"0.1"},{"v":0.1370499092532192,"d":"0.1"},{"v":0.12055669240583239,"d":"0.1"},{"v":0.11935246453026008,"d":"0.1"},{"v":0.11112048479588381,"d":"0.1"},{"v":0.12100655717619774,"d":"0.1"},{"v":0.10941653588109075,"d":"0.1"},{"v":0.11285421394403922,"d":"0.1"},{"v":0.12272369553144535,"d":"0.1"},{"v":0.11713208896519443,"d":"0.1"}]
["Other sources *",{"$f":"SUM(B8:B15)","v":{"v":0.6920154952795425,"d":"0.7"}},{"$f":"SUM(C8:C15)","v":{"v":0.6920154952795425,"d":"0.7"}},{"$nulls":4},{"$f":"SUM(H8:H15)","v":{"v":0.7217402493319907,"d":"0.7"}},null,null,{"$f":"SUM(K8:K15)","v":{"v":0.694511540640512,"d":"0.7"}},{"v":0.6700729298341894,"d":"0.7"},{"v":0.6985581463351718,"d":"0.7"},{"v":0.6894537444059379,"d":"0.7"},{"v":0.6714920405908608,"d":"0.7"},{"v":0.6544236578571169,"d":"0.7"},{"v":0.6403124928080715,"d":"0.6"},{"v":0.6394401070746142,"d":"0.6"},{"v":0.6426298173979074,"d":"0.6"},{"v":0.6264747837111033,"d":"0.6"},{"v":0.5984241277738686,"d":"0.6"},{"v":0.5894824529884507,"d":"0.6"},{"v":0.6025541689127623,"d":"0.6"},{"v":0.5875969544195153,"d":"0.6"},{"v":0.5975589712571672,"d":"0.6"},{"$f":"SUM(Z8:Z15)","v":{"v":0.5964679345809277,"d":"0.6"}},{"$f":"SUM(AA8:AA15)","v":{"v":0.5967091904513803,"d":"0.6"}},{"$f":"SUM(AB8:AB15)","v":{"v":0.5965483030557416,"d":"0.6"}},{"$f":"SUM(AC8:AC15)","v":{"v":0.5781155547300576,"d":"0.6"}}]
["       Energy Supply",{"v":0.11379952323975569,"d":"0.1"},{"v":0.11379952323975569,"d":"0.1"},{"$nulls":4},{"v":0.1224428550373298,"d":"0.1"},null,null,{"v":0.11877293558546721,"d":"0.1"},{"v":0.10238156527557794,"d":"0.1"},{"v":0.14118592306312178,"d":"0.1"},{"v":0.14032654428536928,"d":"0.1"},{"v":0.12843174698867643,"d":"0.1"},{"v":0.12484734738308123,"d":"0.1"},{"v":0.112793952884016,"d":"0.1"},{"v":0.11389733227289059,"d":"0.1"},{"v":0.12475236548283833,"d":"0.1"},{"v":0.10811536368668478,"d":"0.1"},{"v":0.10390499642983554,"d":"0.1"},{"v":0.10136567779252728,"d":"0.1"},{"v":0.11303515567707625,"d":"0.1"},{"v":0.09288924015103489,"d":"0.1"},{"v":0.10433405926025346,"d":"0.1"},{"v":0.0967650372424067,"d":"0.1"},{"v":0.09503418656441784,"d":"0.1"},{"v":0.09144696326208425,"d":"0.1"},{"v":0.06358498402601978,"d":"0.1"}]
["       Transport (excluding international aviation and shipping)",{"v":0.16822967640511838,"d":"0.2"},{"v":0.16822967640511838,"d":"0.2"},{"$nulls":4},{"v":0.21775075810837216,"d":"0.2"},null,null,{"v":0.19918302325876788,"d":"0.2"},{"v":0.1977972858523145,"d":"0.2"},{"v":0.18888868413049556,"d":"0.2"},{"v":0.17708606059485213,"d":"0.2"},{"v":0.17665788888160333,"d":"0.2"},{"v":0.16690191592965645,"d":"0.2"},{"v":0.15995193677039193,"d":"0.2"},{"v":0.1551962007921251,"d":"0.2"},{"v":0.1478995062514656,"d":"0.1"},{"v":0.14674162514766295,"d":"0.1"},{"v":0.1285684502919601,"d":"0.1"},{"v":0.12196764271019239,"d":"0.1"},{"v":0.12021621787822807,"d":"0.1"},{"v":0.11748512520301722,"d":"0.1"},{"v":0.11837929758992694,"d":"0.1"},{"v":0.12079402574378234,"d":"0.1"},{"v":0.12585832081050713,"d":"0.1"},{"v":0.13103456063076777,"d":"0.1"},{"v":0.13610420821019462,"d":"0.1"}]
["       International Aviation and Shipping",{"v":0.01556313888444791,"d":"0.0"},{"v":0.01556313888444791,"d":"0.0"},{"$nulls":4},{"v":0.02025017662279569,"d":"0.0"},null,null,{"v":0.019983469599097,"d":"0.0"},{"v":0.01748424925762872,"d":"0.0"},{"v":0.015683871414650316,"d":"0.0"},{"v":0.017281358170642136,"d":"0.0"},{"v":0.015335841929746791,"d":"0.0"},{"v":0.014204897900542466,"d":"0.0"},{"v":0.016048783105842134,"d":"0.0"},{"v":0.016912742612503855,"d":"0.0"},{"v":0.01782984949165486,"d":"0.0"},{"v":0.018325353968617508,"d":"0.0"},{"v":0.019422558762149413,"d":"0.0"},{"v":0.017748755900475494,"d":"0.0"},{"v":0.015217273544807532,"d":"0.0"},{"v":0.016516815155611667,"d":"0.0"},{"v":0.015253091117094704,"d":"0.0"},{"v":0.01601364505071153,"d":"0.0"},{"v":0.01690775719269697,"d":"0.0"},{"v":0.01742732709181394,"d":"0.0"},{"v":0.018601137226773035,"d":"0.0"}]
["       Waste Management",{"v":0.07025907526599648,"d":"0.1"},{"v":0.07025907526599648,"d":"0.1"},{"$nulls":4},{"v":0.07255795838557726,"d":"0.1"},null,null,{"v":0.07716193721467346,"d":"0.1"},{"v":0.07630522400843304,"d":"0.1"},{"v":0.08034332264589486,"d":"0.1"},{"v":0.08080144760156373,"d":"0.1"},{"v":0.08105832438824681,"d":"0.1"},{"v":0.07901176306005155,"d":"0.1"},{"v":0.08192192953344302,"d":"0.1"},{"v":0.08682769062011834,"d":"0.1"},{"v":0.0898036575574471,"d":"0.1"},{"v":0.09369658971841531,"d":"0.1"},{"v":0.09089357332277664,"d":"0.1"},{"v":0.09730333965385383,"d":"0.1"},{"v":0.10432275228643345,"d":"0.1"},{"v":0.10880771797348918,"d":"0.1"},{"v":0.10759012401536008,"d":"0.1"},{"v":0.10772048068664378,"d":"0.1"},{"v":0.10895006887025839,"d":"0.1"},{"v":0.11034989344651014,"d":"0.1"},{"v":0.11293874677259376,"d":"0.1"}]
["       Residential",{"v":0.041668309653373606,"d":"0.0"},{"v":0.041668309653373606,"d":"0.0"},{"$nulls":4},{"v":0.024819536857788017,"d":"0.0"},null,null,{"v":0.022635893528270303,"d":"0.0"},{"v":0.022643804581960005,"d":"0.0"},{"v":0.019425779633310696,"d":"0.0"},{"v":0.019524023020095947,"d":"0.0"},{"v":0.015843617467668034,"d":"0.0"},{"v":0.014332957559004383,"d":"0.0"},{"v":0.013917319939287921,"d":"0.0"},{"v":0.012902532780442113,"d":"0.0"},{"v":0.012815473934653399,"d":"0.0"},{"v":0.012922658102508904,"d":"0.0"},{"v":0.013973913598119937,"d":"0.0"},{"v":0.013998662265941542,"d":"0.0"},{"v":0.015750684090060935,"d":"0.0"},{"v":0.013931445093488266,"d":"0.0"},{"v":0.014810338590647579,"d":"0.0"},{"v":0.015571809200082288,"d":"0.0"},{"v":0.014108565185896768,"d":"0.0"},{"v":0.014781761152605733,"d":"0.0"},{"v":0.01493248193110187,"d":"0.0"}]
["       Public Sector Buildings",{"v":3.2812406362031543E-3,"d":"0.0"},{"v":3.2812406362031543E-3,"d":"0.0"},{"$nulls":4},{"v":0.002361694401000766,"d":"0.0"},null,null,{"v":1.9328628366123049E-3,"d":"0.0"},{"v":1.8726996648802596E-3,"d":"0.0"},{"v":1.6026296288506165E-3,"d":"0.0"},{"v":1.6094235370912628E-3,"d":"0.0"},{"v":1.1681931029359322E-3,"d":"0.0"},{"v":1.087604542333026E-3,"d":"0.0"},{"v":1.0916288167646586E-3,"d":"0.0"},{"v":0.001141252920125813,"d":"0.0"},{"v":1.0265040956010348E-3,"d":"0.0"},{"v":9.4000359477505952E-4,"d":"0.0"},{"v":9.3101954626416308E-4,"d":"0.0"},{"v":0.00078379896177802,"d":"0.0"},{"v":7.8797182035915869E-4,"d":"0.0"},{"v":6.5395637198777015E-4,"d":"0.0"},{"v":6.9772461631422322E-4,"d":"0.0"},{"v":6.8082506762756807E-4,"d":"0.0"},{"v":5.9881600201842791E-4,"d":"0.0"},{"v":6.2761719115240078E-4,"d":"0.0"},{"v":6.2854708773903774E-4,"d":"0.0"}]
["       Development",{"v":0.14806547499712577,"d":"0.1"},{"v":0.14806547499712577,"d":"0.1"},{"$nulls":4},{"v":0.14603349268088686,"d":"0.1"},null,null,{"v":0.14518297660776186,"d":"0.1"},{"v":0.14518000899132918,"d":"0.1"},{"v":0.14455712088019543,"d":"0.1"},{"v":0.14407726278984825,"d":"0.1"},{"v":0.14421597812678832,"d":"0.1"},{"v":0.14506646219112798,"d":"0.1"},{"v":0.14624145939472674,"d":"0.1"},{"v":0.1456367032921961,"d":"0.1"},{"v":0.14276512869229832,"d":"0.1"},{"v":0.14330784410321787,"d":"0.1"},{"v":0.1431603531356123,"d":"0.1"},{"v":0.14309633579630635,"d":"0.1"},{"v":0.14409550245379932,"d":"0.1"},{"v":0.14371960205438553,"d":"0.1"},{"v":0.1432643706890958,"d":"0.1"},{"v":0.14376071620156142,"d":"0.1"},{"v":0.14286448987199185,"d":"0.1"},{"v":0.14266571905041217,"d":"0.1"},{"v":0.14519954762828088,"d":"0.1"}]
["       Forestry",{"v":0.13114905619752143,"d":"0.1"},{"v":0.13114905619752143,"d":"0.1"},{"$nulls":4},{"v":0.11552377723824002,"d":"0.1"},null,null,{"v":0.10965844200986202,"d":"0.1"},{"v":0.1064080922020658,"d":"0.1"},{"v":0.10687081493865246,"d":"0.1"},{"v":0.10874762440647519,"d":"0.1"},{"v":0.10878044970519511,"d":"0.1"},{"v":0.10897070929131979,"d":"0.1"},{"v":0.10834548236359909,"d":"0.1"},{"v":0.10692565178421216,"d":"0.1"},{"v":0.10573733189194881,"d":"0.1"},{"v":0.10242534538922093,"d":"0.1"},{"v":0.0975692626871504,"d":"0.1"},{"v":0.09321823990737575,"d":"0.1"},{"v":0.0891286111619976,"d":"0.1"},{"v":0.09359305241650087,"d":"0.1"},{"v":0.09322996537847433,"d":"0.1"},{"v":0.09516139538811211,"d":"0.1"},{"v":0.09238698595359299,"d":"0.1"},{"v":0.08821446123039525,"d":"0.1"},{"v":0.08612590184735464,"d":"0.1"}]

{"sheet":"Chart B12 data","index":29,"n_rows":20,"n_cols":29,"rows_kept":20}
["F gases by Scottish Government sector, 1990 to 2016.  Values in MtCO2e"]
[]
[null,"Baseline Period","1990",1991,1992,1993,1994,"1995",1996,1997,"1998","1999","2000","2001","2002","2003","2004","2005","2006","2007","2008","2009","2010","2011","2012",2013,2014,2015,2016]
["HFCs",{"v":0.12641599757222802,"d":"0.1"},{"v":2.12633335046128E-3,"d":"0.0"},{"$nulls":4},{"v":0.12641599757222802,"d":"0.1"},null,null,{"v":0.40123582262959484,"d":"0.4"},{"v":0.43565739197677306,"d":"0.4"},{"v":0.5356030742569307,"d":"0.5"},{"v":0.6375489567389395,"d":"0.6"},{"v":0.7134482220792838,"d":"0.7"},{"v":0.8341384118902315,"d":"0.8"},{"v":0.9241346000831745,"d":"0.9"},{"v":1.0250951505200387,"d":"1.0"},{"v":1.1114796602307724,"d":"1.1"},{"v":1.167967954729541,"d":"1.2"},{"v":1.2095777815163313,"d":"1.2"},{"v":1.28085528956465,"d":"1.3"},{"v":1.3267631233215194,"d":"1.3"},{"v":1.2068717398192474,"d":"1.2"},{"v":1.2461017811663866,"d":"1.2"},{"v":1.2791967242414357,"d":"1.3"},{"v":1.2994102694950873,"d":"1.3"},{"v":1.2951652758448358,"d":"1.3"},{"v":1.2340377279370103,"d":"1.2"}]
["Business and Industrial process",{"v":0.06844066335604355,"d":"0.1"},{"v":2.12633335046128E-3,"d":"0.0"},{"$nulls":4},{"v":0.06844066335604355,"d":"0.1"},null,null,{"v":0.22178628773658382,"d":"0.2"},{"v":0.2865448092479713,"d":"0.3"},{"v":0.3693536391599928,"d":"0.4"},{"v":0.4580036615020291,"d":"0.5"},{"v":0.5493874121422456,"d":"0.5"},{"v":0.6499081580206333,"d":"0.6"},{"v":0.7441825624483092,"d":"0.7"},{"v":0.8210714693687872,"d":"0.8"},{"v":0.9091644605474603,"d":"0.9"},{"v":0.9852864350126816,"d":"1.0"},{"v":1.026142279403495,"d":"1.0"},{"v":1.1058068406624355,"d":"1.1"},{"v":1.1628236229947417,"d":"1.2"},{"v":1.0482977197616152,"d":"1.0"},{"v":1.0875453002775857,"d":"1.1"},{"v":1.1250996756793994,"d":"1.1"},{"v":1.1475044708558573,"d":"1.1"},{"v":1.1480472529605699,"d":"1.1"},{"v":1.0915957707209938,"d":"1.1"}]
["Residential",{"v":0.05797533421618446,"d":"0.1"},{"v":0,"d":"0.0"},{"$nulls":4},{"v":0.05797533421618446,"d":"0.1"},null,null,{"v":0.179449534893011,"d":"0.18"},{"v":0.1491125827288017,"d":"0.15"},{"v":0.1662494350969379,"d":"0.17"},{"v":0.1795452952369104,"d":"0.18"},{"v":0.1640608099370382,"d":"0.16"},{"v":0.1842302538695982,"d":"0.18"},{"v":0.1799520376348654,"d":"0.18"},{"v":0.20402368115125172,"d":"0.20"},{"v":0.2023151996833121,"d":"0.20"},{"v":0.1826815197168594,"d":"0.18"},{"v":0.1834355021128363,"d":"0.18"},{"v":0.17504844890221433,"d":"0.18"},{"v":0.16393950032677748,"d":"0.16"},{"v":0.1585740200576322,"d":"0.16"},{"v":0.1585564808888009,"d":"0.16"},{"v":0.1540970485620365,"d":"0.15"},{"v":0.15190579863922987,"d":"0.15"},{"v":0.14711802288426587,"d":"0.15"},{"v":0.14244195721601638,"d":"0.1"}]
["PFCs",{"v":0.11577667341186272,"d":"0.1"},{"v":0.13727346160182707,"d":"0.1"},{"$nulls":4},{"v":0.11577667341186272,"d":"0.1"},null,null,{"v":0.14810676012777152,"d":"0.1"},{"v":0.15777672016393637,"d":"0.2"},{"v":0.15405574968489208,"d":"0.2"},{"v":0.08869558846071578,"d":"0.1"},{"v":0.11485314705973539,"d":"0.1"},{"v":0.11586000492254916,"d":"0.1"},{"v":0.1027457485790312,"d":"0.1"},{"v":0.09598786424995992,"d":"0.1"},{"v":0.09219848766856414,"d":"0.1"},{"v":0.08566612621488488,"d":"0.1"},{"v":0.08264312530516069,"d":"0.1"},{"v":0.07901263926755193,"d":"0.1"},{"v":0.07624150979922684,"d":"0.1"},{"v":0.08041752710744748,"d":"0.1"},{"v":0.0898329455943312,"d":"0.1"},{"v":0.09854776908382445,"d":"0.1"},{"v":0.1420077996787349,"d":"0.1"},{"v":0.1195490772024328,"d":"0.1"},{"v":0.1322111688988696,"d":"0.1"}]
["Business and Industrial process",{"v":0.11577667341186272,"d":"0.1"},{"v":0.13727346160182707,"d":"0.1"},{"$nulls":4},{"v":0.11577667341186272,"d":"0.1"},null,null,{"v":0.14810676012777152,"d":"0.1"},{"v":0.15777672016393637,"d":"0.2"},{"v":0.15405574968489208,"d":"0.2"},{"v":0.08869558846071578,"d":"0.1"},{"v":0.11485314705973539,"d":"0.1"},{"v":0.11586000492254916,"d":"0.1"},{"v":0.1027457485790312,"d":"0.1"},{"v":0.09598786424995992,"d":"0.1"},{"v":0.09219848766856414,"d":"0.1"},{"v":0.08566612621488488,"d":"0.1"},{"v":0.08264312530516069,"d":"0.1"},{"v":0.07901263926755193,"d":"0.1"},{"v":0.07624150979922684,"d":"0.1"},{"v":0.08041752710744748,"d":"0.1"},{"v":0.0898329455943312,"d":"0.1"},{"v":0.09854776908382445,"d":"0.1"},{"v":0.1420077996787349,"d":"0.1"},{"v":0.1195490772024328,"d":"0.1"},{"v":0.1322111688988696,"d":"0.1"}]
["SF6",{"v":0.03603194921477631,"d":"0.0"},{"v":0.047104139904197644,"d":"0.0"},{"$nulls":4},{"v":0.03603194921477631,"d":"0.0"},null,null,{"v":0.04503596979565225,"d":"0.0"},{"v":0.05426871088885925,"d":"0.1"},{"v":0.05575155907299125,"d":"0.1"},{"v":0.05266430661866743,"d":"0.1"},{"v":0.0539848911465591,"d":"0.1"},{"v":0.052704117362467946,"d":"0.1"},{"v":0.05824301837539487,"d":"0.1"},{"v":0.06429553012640034,"d":"0.1"},{"v":0.04881716414985225,"d":"0.0"},{"v":0.04722772807000918,"d":"0.0"},{"v":0.04044724209956973,"d":"0.0"},{"v":0.03714697058111189,"d":"0.0"},{"v":0.03956957730806739,"d":"0.0"},{"v":0.037846917641331926,"d":"0.0"},{"v":0.036735283953572104,"d":"0.0"},{"v":0.032081324265154816,"d":"0.0"},{"v":0.0314863883400576,"d":"0.0"},{"v":0.03212342612555018,"d":"0.0"},{"v":0.03611193230062993,"d":"0.0"}]
["Business and Industrial process",{"v":0.03603194921477631,"d":"0.0"},{"v":0.047104139904197644,"d":"0.0"},{"$nulls":4},{"v":0.03603194921477631,"d":"0.0"},null,null,{"v":0.04503596979565225,"d":"0.0"},{"v":0.05426871088885925,"d":"0.1"},{"v":0.05575155907299125,"d":"0.1"},{"v":0.05266430661866743,"d":"0.1"},{"v":0.0539848911465591,"d":"0.1"},{"v":0.052704117362467946,"d":"0.1"},{"v":0.05824301837539487,"d":"0.1"},{"v":0.06429553012640034,"d":"0.1"},{"v":0.04881716414985225,"d":"0.0"},{"v":0.04722772807000918,"d":"0.0"},{"v":0.04044724209956973,"d":"0.0"},{"v":0.03714697058111189,"d":"0.0"},{"v":0.03956957730806739,"d":"0.0"},{"v":0.037846917641331926,"d":"0.0"},{"v":0.036735283953572104,"d":"0.0"},{"v":0.032081324265154816,"d":"0.0"},{"v":0.0314863883400576,"d":"0.0"},{"v":0.03212342612555018,"d":"0.0"},{"v":0.03611193230062993,"d":"0.0"}]
["NF3",{"v":0.000500835822402898,"d":"0.0"},{"v":0.000203353200600544,"d":"0.0"},{"$nulls":4},{"v":0.000500835822402898,"d":"0.0"},null,null,{"v":0.000660147523877406,"d":"0.0"},{"v":0.000759169652459016,"d":"0.0"},{"v":0.000883983920434688,"d":"0.0"},{"v":0.00054126746709938,"d":"0.0"},{"v":0.0007231382928,"d":"0.0"},{"v":0.00066812595643135,"d":"0.0"},{"v":0.000412266054869747,"d":"0.0"},{"v":2.0207115444095E-4,"d":"0.0"},{"v":2.0036818419339201E-4,"d":"0.0"},{"v":1.96303908351915E-4,"d":"0.0"},{"v":1.89423095500207E-4,"d":"0.0"},{"v":1.7920308099463899E-4,"d":"0.0"},{"v":1.90561764227207E-4,"d":"0.0"},{"v":0.000209617940649928,"d":"0.0"},{"v":2.30579734714921E-4,"d":"0.0"},{"v":0.000253637708186413,"d":"0.0"},{"v":0.000279001479005054,"d":"0.0"},{"v":0.00030690162690556,"d":"0.0"},{"v":0.000337591789596116,"d":"0.0"}]
["Business and Industrial process",{"v":0.000500835822402898,"d":"0.0"},{"v":0.000203353200600544,"d":"0.0"},{"$nulls":4},{"v":0.000500835822402898,"d":"0.0"},null,null,{"v":0.000660147523877406,"d":"0.0"},{"v":0.000759169652459016,"d":"0.0"},{"v":0.000883983920434688,"d":"0.0"},{"v":0.00054126746709938,"d":"0.0"},{"v":0.0007231382928,"d":"0.0"},{"v":0.00066812595643135,"d":"0.0"},{"v":0.000412266054869747,"d":"0.0"},{"v":2.0207115444095E-4,"d":"0.0"},{"v":2.0036818419339201E-4,"d":"0.0"},{"v":1.96303908351915E-4,"d":"0.0"},{"v":1.89423095500207E-4,"d":"0.0"},{"v":1.7920308099463899E-4,"d":"0.0"},{"v":1.90561764227207E-4,"d":"0.0"},{"v":0.000209617940649928,"d":"0.0"},{"v":2.30579734714921E-4,"d":"0.0"},{"v":0.000253637708186413,"d":"0.0"},{"v":0.000279001479005054,"d":"0.0"},{"v":0.00030690162690556,"d":"0.0"},{"v":0.000337591789596116,"d":"0.0"}]
[]
[]
[]
["F gases Total",{"$f":"SUM(B4+B7+B9+B11)","v":{"v":0.27872545602126997,"d":"0.3"}},{"$f":"SUM(C4+C7+C9+C11)","v":{"v":0.18670728805708656,"d":"0.2"}},{"v":0,"d":"0.0"},{"v":0,"d":"0.0"},{"v":0,"d":"0.0"},{"v":0,"d":"0.0"},{"v":0.27872545602126997,"d":"0.3"},{"v":0,"d":"0.0"},{"v":0,"d":"0.0"},{"v":0.5950387000768961,"d":"0.6"},{"v":0.6484619926820276,"d":"0.6"},{"v":0.7462943669352486,"d":"0.7"},{"v":0.7794501192854221,"d":"0.8"},{"v":0.8830093985783783,"d":"0.9"},{"v":1.00337066013168,"d":"1.0"},{"v":1.0855356330924704,"d":"1.1"},{"v":1.18558061605084,"d":"1.2"},{"v":1.2526956802333822,"d":"1.3"},{"v":1.3010581129227867,"d":"1.3"},{"v":1.3328575720165619,"d":"1.3"},{"v":1.3971941024943082,"d":"1.4"},{"v":1.4427647721930408,"d":"1.4"},{"v":1.3253458025086766,"d":"1.3"},{"v":1.3729005904490048,"d":"1.4"},{"v":1.4100794552986011,"d":"1.4"},{"v":1.473183458992885,"d":"1.5"},{"v":1.4471446807997241,"d":"1.4"},{"v":1.402698420926106,"d":"1.4"}]
["Business and Industrial process",{"$f":"B5+B8+B10+B12","v":{"v":0.2207501218050855,"d":"0.2"}},{"$f":"C5+C8+C10+C12","v":{"v":0.18670728805708656,"d":"0.2"}},{"$nulls":4},{"$f":"H5+H8+H10+H12","v":{"v":0.2207501218050855,"d":"0.2"}},null,null,{"$f":"K5+K8+K10+K12","v":{"v":0.41558916518388495,"d":"0.4"}},{"$f":"L5+L8+L10+L12","v":{"v":0.499349409953226,"d":"0.5"}},{"v":0.5800449318383107,"d":"0.6"},{"v":0.5999048240485116,"d":"0.6"},{"v":0.7189485886413401,"d":"0.7"},{"v":0.8191404062620818,"d":"0.8"},{"v":0.905583595457605,"d":"0.9"},{"v":0.9815569348995884,"d":"1.0"},{"v":1.05038048055007,"d":"1.1"},{"v":1.1183765932059275,"d":"1.1"},{"v":1.1494220699037254,"d":"1.1"},{"v":1.2221456535920938,"d":"1.2"},{"v":1.2788252718662632,"d":"1.3"},{"v":1.1667717824510444,"d":"1.2"},{"v":1.2143441095602039,"d":"1.2"},{"v":1.2559824067365648,"d":"1.3"},{"v":1.321277660353655,"d":"1.3"},{"v":1.3000266579154582,"d":"1.3"},{"v":1.2602564637100895,"d":"1.3"}]
["Residential",{"$f":"B6","v":{"v":0.05797533421618446,"d":"0.1"}},{"$f":"C6","v":{"v":0,"d":"0.0"}},{"$nulls":4},{"$f":"H6","v":{"v":0.05797533421618446,"d":"0.1"}},null,null,{"$f":"K6","v":{"v":0.179449534893011,"d":"0.2"}},{"$f":"L6","v":{"v":0.1491125827288017,"d":"0.1"}},{"v":0.1662494350969379,"d":"0.2"},{"v":0.1795452952369104,"d":"0.2"},{"v":0.1640608099370382,"d":"0.2"},{"v":0.1842302538695982,"d":"0.2"},{"v":0.1799520376348654,"d":"0.2"},{"v":0.20402368115125172,"d":"0.2"},{"v":0.2023151996833121,"d":"0.2"},{"v":0.1826815197168594,"d":"0.2"},{"v":0.1834355021128363,"d":"0.2"},{"v":0.17504844890221433,"d":"0.2"},{"v":0.16393950032677748,"d":"0.2"},{"v":0.1585740200576322,"d":"0.2"},{"v":0.1585564808888009,"d":"0.2"},{"v":0.1540970485620365,"d":"0.2"},{"v":0.15190579863922987,"d":"0.2"},{"v":0.14711802288426587,"d":"0.1"},{"v":0.14244195721601638,"d":"0.1"}]
[]
["Check totals correct?",{"$f":"IF(B17+B18=B16,\"Yes\",\"No\")","v":"Yes"},{"$f":"IF(C17+C18=C16,\"Yes\",\"No\")","v":"Yes"},{"$nulls":4},{"$f":"IF(H17+H18=H16,\"Yes\",\"No\")","v":"Yes"},null,null,{"$f":"IF(K17+K18=K16,\"Yes\",\"No\")","v":"Yes"},{"$f":"IF(L17+L18=L16,\"Yes\",\"No\")","v":"Yes"},"Yes","Yes","Yes","Yes","Yes","Yes","Yes","Yes","Yes","Yes","Yes","Yes","Yes","Yes","Yes","Yes","Yes"]

{"sheet":"Chart C1 data","index":31,"n_rows":46,"n_cols":7,"rows_kept":46,"merged":[[0,0,0,6]]}
["Estimate of Traded Emissions Surrendered in the EU Emissions Trading System (EU ETS) and Non-Traded Greenhouse Gas Emissions by Scottish Government Sector, 2016.  Values in MtCO2e"]
[]
[]
[null,"Traded Greenhouse Gases","Non-Traded Greenhouse Gases","Total","% of emissions that are traded - 2016","% of traded emissions - 2016","% of non-traded emissions - 2016"]
["Net Scottish Greenhouse Gases",{"$f":"'Chart C2 data'!B6","v":{"v":12.165724998078057,"d":"12.2"}},{"$f":"'Chart C2 data'!B5","v":{"v":26.408533791393104,"d":"26.4"}},{"$f":"'Chart B1 data'!B4","v":{"v":38.5742587894712,"d":"38.6"}},{"$f":"B5/D5","v":{"v":0.3153845434717381,"d":"31.5%"}},{"$f":"B5/B$5","v":{"v":1,"d":"100.0%"}},{"$f":"C5/C$5","v":{"v":1,"d":"100.0%"}}]
["Energy Supply",{"$f":"B21","v":{"v":6.4742782675731,"d":"6.5"}},{"$f":"D6-B6","v":{"v":0.685074125583518,"d":"0.7"}},{"$f":"'Chart B1 data'!B8","v":{"v":7.159352393156618,"d":"7.2"}},{"$f":"B6/D6","v":{"v":0.9043106012998666,"d":"90.4%"}},{"$f":"B6/B$5","v":{"v":0.5321736492149796,"d":"53.2%"}},{"$f":"C6/C$5","v":{"v":0.025941391937737673,"d":"2.6%"}}]
["Transport (including international aviation and shipping)",{"$f":"B31","v":{"v":1.9034619980780556,"d":"1.9"}},{"$f":"D7-B7","v":{"v":12.493810559653602,"d":"12.5"}},{"$f":"'Chart B1 data'!B5","v":{"v":14.397272557731657,"d":"14.4"}},{"$f":"B7/D7","v":{"v":0.13220990228846186,"d":"13.2%"}},{"$f":"B7/B$5","v":{"v":0.15646104102951242,"d":"15.6%"}},{"$f":"C7/C$5","v":{"v":0.4730974713834928,"d":"47.3%"}}]
["Agriculture and Related Land Use",null,{"$f":"D8-B8","v":{"v":10.049052861385226,"d":"10.0"}},{"$f":"'Chart B1 data'!B6","v":{"v":10.049052861385226,"d":"10.0"}},{"$f":"B8/D8","v":{"v":0,"d":"0.0%"}},{"$f":"B8/B$5","v":{"v":0,"d":"0.0%"}},{"v":0.38052293780354995,"d":"38.1%"}]
["Business and Industrial Process",{"$f":"B20","v":{"v":3.619653650281839,"d":"3.6"}},{"$f":"D9-B9","v":{"v":4.9499398093226805,"d":"4.9"}},{"$f":"'Chart B1 data'!B7","v":{"v":8.56959345960452,"d":"8.6"}},{"v":0.4223833566136151,"d":"42.2%"},{"v":0.29752880743676785,"d":"29.8%"},{"v":0.18743713105859486,"d":"18.7%"}]
["Residential",null,{"$f":"D10-B10","v":{"v":6.315866349380111,"d":"6.3"}},{"$f":"'Chart B1 data'!B9","v":{"v":6.315866349380111,"d":"6.3"}},{"v":0,"d":"0.0%"},{"$f":"B10/B$5","v":{"v":0,"d":"0.0%"}},{"v":0.23916005330968193,"d":"23.9%"}]
["Waste Management",null,{"v":1.6417933315883455,"d":"1.6"},{"$f":"'Chart B1 data'!B11","v":{"v":1.6417933315883455,"d":"1.6"}},{"v":0,"d":"0.0%"},{"v":0,"d":"0.0%"},{"v":0.062169045224442866,"d":"6.2%"}]
["Development",null,{"v":2.02380440492892,"d":"2.0"},{"$f":"'Chart B1 data'!B10","v":{"v":2.02380440492892,"d":"2.0"}},{"v":0,"d":"0.0%"},{"v":0,"d":"0.0%"},{"v":0.07663448568994409,"d":"7.7%"}]
["Public Sector Buildings",{"$f":"B22","v":{"v":0.1683310821450599,"d":"0.2"}},{"v":0.9125427655276692,"d":"0.9"},{"$f":"'Chart B1 data'!B12","v":{"v":1.080873847672729,"d":"1.1"}},{"v":0.15573610417857736,"d":"15.6%"},{"v":0.013836502318739974,"d":"1.4%"},{"v":0.034554844003686386,"d":"3.5%"}]
["Forestry",null,{"v":-12.663350415976959,"d":"-12.7"},{"$f":"'Chart B1 data'!B13","v":{"v":-12.663350415976959,"d":"-12.7"}},{"v":0,"d":"0.0%"},{"v":0,"d":"0.0%"},{"v":-0.47951736041113024,"d":"-48.0%"}]
[]
[]
["Estimate of traded greenhouse gases surrendered for fixed installations by sector, 2016.  Values in MtCO2e"]
[]
[null,2016,"% shares "]
["Business and Industrial Process",{"$f":"C20*B$23","v":{"v":3.619653650281839,"d":"3.620"}},{"$f":"(E38+E40)/E$46","v":{"v":0.35271495675776765,"d":"35.3%"}}]
["Energy Supply",{"$f":"C21*B$23","v":{"v":6.4742782675731,"d":"6.474"}},{"$f":"E39/E$46","v":{"v":0.6308821229365393,"d":"63.1%"}}]
["Public Sector Buildings",{"$f":"C22*B$23","v":{"v":0.1683310821450599,"d":"0.168"}},{"$f":"E42/E$46","v":{"v":0.0164029203056928,"d":"1.6%"}}]
["TOTAL SURRENDERED EMISSIONS",{"$f":"(B5-B31)","v":{"v":10.262263,"d":"10.262"}},{"$f":"SUM(C20:C22)","v":{"v":0.9999999999999998,"d":"100.0%"}}]
[]
[]
["Estimate of traded CO2 emissions from aviation, 2016.   Values in MtCO2"]
[]
[null,2016]
["Domestic aviation - CO2",{"v":0.4781566879085551,"d":"0.478"}]
["International Aviation - CO2",{"v":1.4253053101695006,"d":"1.425"}]
["Total Aviation - CO2",{"$f":"SUM(B29:B30)","v":{"v":1.9034619980780556,"d":"1.903"}}]
[]
[]
["Data from Devolved Administrations Inventory, 1990-2016 (excluding international aviation and shipping)"]
[]
[]
[2016,"Agriculture",{"v":7766.082972443917,"d":"7,766"},{"v":7766.082972443917,"d":"7,766"},0,{"v":7766.082972443917,"d":"7,766"},{"v":0,"d":"0.0%"}]
[null,"Business",{"v":6603.631826920322,"d":"6,604"},{"v":6968.738737518755,"d":"6,969"},{"v":2212.7225198200003,"d":"2,213"},{"v":4390.909307100322,"d":"4,391"},{"v":0.3350766029686316,"d":"33.5%"}]
[null,"Energy Supply",{"v":7159.352393156616,"d":"7,159"},{"v":7159.35239315662,"d":"7,159"},{"v":6581.458216599998,"d":"6,581"},{"v":577.8941765566178,"d":"578"},{"v":0.9192812219846858,"d":"91.9%"}]
[null,"Industrial Process",{"v":1965.961632684198,"d":"1,966"},{"v":1600.854722085764,"d":"1,601"},{"v":1466.8535307200011,"d":"1,467"},{"v":499.108101964197,"d":"499"},{"v":0.7461252072947392,"d":"74.6%"}]
[null,"Land Use Change",{"v":-8356.57612210673,"d":"-8,357"},{"v":-8356.57612210673,"d":"-8,357"},0,{"v":-8356.57612210673,"d":"-8,357"},{"v":0,"d":"0.0%"}]
[null,"Public",{"v":1080.873847672729,"d":"1,081"},{"v":1080.873847672729,"d":"1,081"},{"v":171.11775829000004,"d":"171"},{"v":909.756089382729,"d":"910"},{"v":0.1583142738243138,"d":"15.8%"}]
[null,"Residential",{"v":6312.740724386883,"d":"6,313"},{"v":6312.740724386882,"d":"6,313"},0,{"v":6312.740724386883,"d":"6,313"},{"v":0,"d":"0.0%"}]
[null,"Transport",{"v":12579.426526240271,"d":"12,579"},{"v":12579.426526240268,"d":"12,579"},0,{"v":12579.426526240271,"d":"12,579"},{"v":0,"d":"0.0%"}]
[null,"Waste Management",{"v":1644.9189565815743,"d":"1,645"},{"v":1644.918956581574,"d":"1,645"},0,{"v":1644.9189565815743,"d":"1,645"},{"v":0,"d":"0.0%"}]
[null,"2016 Total",{"v":36756.41275797978,"d":"36,756"},{"v":36756.412757979786,"d":"36,756"},{"v":10432.152025430001,"d":"10,432"},{"v":26324.260732549777,"d":"26,324"},{"v":0.2838185568901903,"d":"28.4%"}]

{"sheet":"Chart C2 data","index":33,"n_rows":42,"n_cols":6,"rows_kept":42}
["Calculation of Adjusted Emissions to take into account of trading in the EU Emissions Trading System, 2016.  Values in MtCO2e"]
[]
[null,"SOURCE EMISSIONS",null,null,"ADJUSTED EMISSIONS"]
[null,"STEP 1","STEP 2","STEP 3","STEP 4","Difference between EU ETS cap and EU ETS surrendered emissions for Scotland"]
["Non-traded",{"$f":"B7-B6","v":{"v":26.408533791393104,"d":"26.409"}},{"$f":"B5","v":{"v":26.408533791393104,"d":"26.409"}},{"$f":"B5","v":{"v":26.408533791393104,"d":"26.409"}},{"$f":"B5","v":{"v":26.408533791393104,"d":"26.409"}}]
["Traded - fixed installations and aviation",{"$f":"B14","v":{"v":12.165724998078057,"d":"12.166"}},{"$f":"B6","v":{"v":12.165724998078057,"d":"12.166"}},{"$f":"B17","v":{"v":15.072488,"d":"15.072"}},{"$f":"D6","v":{"v":15.072488,"d":"15.072"}}]
["Total",{"$f":"'A1. Headline Chart data'!AB4","v":{"v":38.57425878947116,"d":"38.574"}},{"$f":"B7","v":{"v":38.57425878947116,"d":"38.574"}},{"$f":"D5+D6","v":{"v":41.481021791393104,"d":"41.481"}},{"$f":"E5+E6","v":{"v":41.481021791393104,"d":"41.481"}},{"$f":"E7-B7","v":{"v":2.906763001921945,"d":"2.907"}}]
[]
[]
[]
["Traded emissions surrendered in 2016 - fixed installations",{"$f":"B22/1000000","v":{"v":10.262263,"d":"10.262"}}]
["CO2 emissions from Domestic Aviation",{"v":0.478156687908555,"d":"0.478"}]
["CO2 emissions from International Aviation",{"v":1.4253053101695,"d":"1.425"},{"$f":"B12+B13","v":{"v":1.903461998078055,"d":"1.903"}}]
["SURRENDERED EU ETS EMISSIONS - INCLUDING AVIATION",{"$f":"B11+B12+B13","v":{"v":12.165724998078057,"d":"12.166"}}]
[]
[]
["EU ETS cap for 2016 (fixed installations and aviation)",{"$f":"B42/1000000","v":{"v":15.072488,"d":"15.072"}}]
[]
[]
[]
[]
["Traded emissions surrendered in 2016 - fixed installations",{"v":10262263,"d":"10,262,263"}]
["CO2 emissions from Domestic Aviation",{"$f":"B12*1000000","v":{"v":478156.687908555,"d":"478,157"}}]
["CO2 emissions from International Aviation",{"$f":"B13*1000000","v":{"v":1425305.3101694998,"d":"1,425,305"}},{"$f":"SUM(B23:B24)","v":{"v":1903461.9980780547,"d":"1,903,462"}}]
["SURRENDERED EU ETS EMISSIONS - INCLUDING AVIATION",{"$f":"B22+B23+B24","v":{"v":12165724.998078054,"d":"12,165,725"}}]
[]
[]
[]
[]
[]
["Total EU-ETS cap for Scotland, 2016"]
["Component","2016 Allocation tCO2e"]
["Fixed Installations",{"v":13707475,"d":"13,707,475"}]
["Auctioned allowances",{"v":7789520,"d":"7,789,520"}]
["Free allocation",{"v":5917955,"d":"5,917,955"}]
["New Entrant’s Reserve",0]
[]
["Aviation",{"v":1365013,"d":"1,365,013"}]
["Domestic",{"v":443255,"d":"443,255"}]
["International",{"v":921758,"d":"921,758"}]
[]
["Total 2016 Cap",{"v":15072488,"d":"15,072,488"}]

{"sheet":"Charts C3 and C4 data","index":36,"n_rows":12,"n_cols":62,"rows_kept":12}
["Adjusted emissions to take into account of trading in the EU Emissions Trading System (EU ETS) - 1990-2016 inventory, and fixed annual targets based on 1990-2008 inventory.  Values in MtCO2e"]
[]
[]
[null,"Baseline Period",1991,1992,1993,1994,"1995",1996,1997,"1998","1999","2000","2001","2002","2003","2004","2005","2006","2007","2008",2009,2010,2011,2012,2013,2014,2015,2016,2017,2018,2019,2020,2021,2022,2023,2024,2025,2026,2027,2028,2029,2030,2031,2032,2033,2034,2035,2036,2037,2038,2039,2040,2041,2042,2043,2044,2045,2046,2047,2048,2049,2050]
["1990-2008 INVENTORY",{"v":70.20120874203609,"d":"70.201"},{"$nulls":4},{"v":67.76163721875098,"d":"67.762"},null,null,{"v":67.68051310799294,"d":"67.681"},{"v":63.30851782152598,"d":"63.309"},{"v":65.45695192451284,"d":"65.457"},{"v":64.79840940895608,"d":"64.798"},{"v":60.91428754134765,"d":"60.914"},{"v":60.50633074831477,"d":"60.506"},{"v":58.460200245494015,"d":"58.460"},{"v":58.56297831311134,"d":"58.563"},{"v":57.76956294336133,"d":"57.770"},{"v":57.46617876117515,"d":"57.466"},{"v":55.32588022107971,"d":"55.326"}]
["1990-2016 INVENTORY",{"v":75.68784905878555,"d":"75.688"},{"$nulls":4},{"v":75.55267192997547,"d":"75.553"},null,null,{"v":74.15235157475476,"d":"74.152"},{"v":70.90328943181305,"d":"70.903"},{"v":71.99046284487693,"d":"71.990"},{"v":71.31210533764722,"d":"71.312"},{"v":67.02675087356991,"d":"67.027"},{"v":66.61594878909973,"d":"66.616"},{"v":64.1232963024878,"d":"64.123"},{"v":62.86526404350645,"d":"62.865"},{"v":60.55657398971789,"d":"60.557"},{"v":59.66830937108004,"d":"59.668"},{"v":57.785240378429144,"d":"57.785"},{"v":55.16305140690079,"d":"55.163"},{"v":54.721617249694525,"d":"54.722"},{"v":52.045624951171305,"d":"52.046"},{"v":54.22680281848274,"d":"54.227"},{"v":45.157875766739856,"d":"45.158"},{"v":39.54108411797707,"d":"39.541"},40.45916676016883,41.481021791393104]
["Fixed Annual Targets",{"$nulls":20},53.652,53.404,53.226,47.976,46.958,45.928,44.933,43.946,42.966,41.976,40.717,39.495,38.31,37.161,35.787,34.117,32.446,30.777]
["Comparison with fixed annual target",{"$nulls":20},{"$f":"V6-V7","v":{"v":1.0696172496945238,"d":"1.070"}},{"v":-1.358375048828698,"d":"-1.358"},{"v":1.0008028184827396,"d":"1.001"},{"v":-2.818124233260143,"d":"-2.818"},{"v":-7.416915882022927,"d":"-7.417"},{"v":-5.46883323983117,"d":"-5.469"},{"v":-3.4519782086068957,"d":"-3.452"}]
["% reduction to fixed targets based on 1990-2008 inventory",{"$nulls":20},{"$f":"(V$7-$B5)/$B5","v":{"v":-0.23573965517956263,"d":"-23.6%"}},{"v":-0.23927235788431675,"d":"-23.9%"},{"v":-0.24180792676111615,"d":"-24.2%"},{"v":-0.3165929638577257,"d":"-31.7%"},{"v":-0.33109413866998255,"d":"-33.1%"},{"v":-0.34576625070988887,"d":"-34.6%"},{"v":-0.35993979583581764,"d":"-36.0%"},{"v":-0.3739993828099803,"d":"-37.4%"},{"v":-0.3879592564013474,"d":"-38.8%"},{"v":-0.40206157768242234,"d":"-40.2%"},{"v":-0.41999574181663785,"d":"-42.0%"},{"v":-0.43740284949893443,"d":"-43.7%"},{"v":-0.45428290072931193,"d":"-45.4%"},{"v":-0.47065014027674135,"d":"-47.1%"},{"v":-0.4902224528425969,"d":"-49.0%"},{"v":-0.5140112170238041,"d":"-51.4%"},{"v":-0.5378142259739822,"d":"-53.8%"},{"v":-0.5615887453862186,"d":"-56.2%"}]
["% reduction to fixed targets based on 1990-2015 inventory",{"$nulls":20},{"$f":"(V$7-$B6)/$B6","v":{"v":-0.2911411717047297,"d":"-29.1%"}},{"v":-0.29441778747706293,"d":"-29.4%"},{"v":-0.2967695520233345,"d":"-29.7%"},{"v":-0.36613339397797123,"d":"-36.6%"},{"v":-0.3795833732369846,"d":"-38.0%"},{"v":-0.3931918984204657,"d":"-39.3%"},{"v":-0.40633799799091586,"d":"-40.6%"},{"v":-0.41937840027838763,"d":"-41.9%"},{"v":-0.4323263174432531,"d":"-43.2%"},{"v":-0.44540635621184177,"d":"-44.5%"},{"v":-0.46204046612058225,"d":"-46.2%"},{"v":-0.4781857260955472,"d":"-47.8%"},{"v":-0.4938421361367366,"d":"-49.4%"},{"v":-0.5090229084045228,"d":"-50.9%"},{"v":-0.5271764167560792,"d":"-52.7%"},{"v":-0.5492407245778399,"d":"-54.9%"},{"v":-0.5713182445599728,"d":"-57.1%"},{"v":-0.5933693402213611,"d":"-59.3%"}]
["42% reduction (based on 1990-2015 inventory)",{"$nulls":30},{"$f":"0.58*B6","v":{"v":43.898952454095614,"d":"43.899"}}]
["80% reduction (based on 1990-2015 inventory)",{"$nulls":60},{"$f":"0.2*B6","v":{"v":15.13756981175711,"d":"15.138"}}]

{"sheet":"Chart C5 data","index":38,"n_rows":11,"n_cols":24,"rows_kept":11,"merged":[[3,1,4,1],[5,1,8,1],[9,1,10,1]]}
["Scottish greenhouse gas emissions adjusted to take account of trading in the EU Emissions Trading System. Baseline to 2016.  Values in MtCO2e"]
[]
[{"$nulls":3},"Baseline Period",1995,1998,1999,2000,2001,2002,2003,2004,2005,2006,2007,2008,2009,2010,2011,2012,2013,2014,2015,2016]
[null,"No allowance for EU ETS","Total Scottish greenhouse gas emissions (including international aviation and shipping)",{"$f":"'A1. Headline Chart data'!A4","v":{"v":75.68784905878555,"d":"75.688"}},{"$f":"'A1. Headline Chart data'!G4","v":{"v":75.55267192997547,"d":"75.553"}},{"$f":"'A1. Headline Chart data'!J4","v":{"v":74.15235157475476,"d":"74.152"}},{"$f":"'A1. Headline Chart data'!K4","v":{"v":70.90328943181305,"d":"70.903"}},{"$f":"'A1. Headline Chart data'!L4","v":{"v":71.99046284487693,"d":"71.990"}},{"$f":"'A1. Headline Chart data'!M4","v":{"v":71.31210533764722,"d":"71.312"}},{"$f":"'A1. Headline Chart data'!N4","v":{"v":67.02675087356991,"d":"67.027"}},{"$f":"'A1. Headline Chart data'!O4","v":{"v":66.61594878909973,"d":"66.616"}},{"$f":"'A1. Headline Chart data'!P4","v":{"v":64.1232963024878,"d":"64.123"}},{"$f":"'A1. Headline Chart data'!Q4","v":{"v":62.112226296694615,"d":"62.112"}},{"$f":"'A1. Headline Chart data'!R4","v":{"v":64.32563724290605,"d":"64.326"}},{"$f":"'A1. Headline Chart data'!S4","v":{"v":59.945756624268206,"d":"59.946"}},{"$f":"'A1. Headline Chart data'!T4","v":{"v":58.64389337842914,"d":"58.644"}},{"$f":"'A1. Headline Chart data'!U4","v":{"v":54.217467406900795,"d":"54.217"}},{"$f":"'A1. Headline Chart data'!V4","v":{"v":55.823196249694526,"d":"55.823"}},{"$f":"'A1. Headline Chart data'!W4","v":{"v":49.162921951171306,"d":"49.163"}},{"$f":"'A1. Headline Chart data'!X4","v":{"v":51.456868100149684,"d":"51.457"}},{"$f":"'A1. Headline Chart data'!Y4","v":{"v":48.394279053135755,"d":"48.394"}},{"$f":"'A1. Headline Chart data'!Z4","v":{"v":44.35947734327685,"d":"44.359"}},{"$f":"'A1. Headline Chart data'!AA4","v":{"v":43.00581593138048,"d":"43.006"}},{"$f":"'A1. Headline Chart data'!AB4","v":{"v":38.57425878947116,"d":"38.574"}}]
[null,null,"Percentage change from baseline",null,{"$f":"(E4-$D4)/$D4","v":{"v":-1.7859819045072981E-3,"d":"-0.2%"}},{"$f":"(F4-$D4)/$D4","v":{"v":-0.020287239010295936,"d":"-2.0%"}},{"$f":"(G4-$D4)/$D4","v":{"v":-0.06321436910244871,"d":"-6.3%"}},{"v":-0.048850459616535204,"d":"-4.9%"},{"v":-0.0578130277918157,"d":"-5.8%"},{"v":-0.11443181822340728,"d":"-11.4%"},{"v":-0.11985940124470722,"d":"-12.0%"},{"v":-0.15279272565026575,"d":"-15.3%"},{"v":-0.17936330508675125,"d":"-17.9%"},{"v":-0.1501193646955754,"d":"-15.0%"},{"v":-0.20798704984059868,"d":"-20.8%"},{"v":-0.22518747582744275,"d":"-22.5%"},{"v":-0.2836701256394411,"d":"-28.4%"},{"v":-0.26245497865400375,"d":"-26.2%"},{"v":-0.35045159080967875,"d":"-35.0%"},{"v":-0.3201436064039294,"d":"-32.0%"},{"v":-0.3606070240475629,"d":"-36.1%"},{"v":-0.41391547130869644,"d":"-41.4%"},{"v":-0.4318002629724812,"d":"-43.2%"},{"v":-0.4903507066304507,"d":"-49.0%"}]
[null,null,"Differences between EU ETS cap and EU ETS surrendered emissions for Scotland",{"$nulls":9},{"v":0.570539,"d":"0.571"},{"v":-3.9515619999999996,"d":"-3.952"},{"v":-0.45994599999999974,"d":"-0.460"},{"v":-0.774653,"d":"-0.775"},{"v":1.029584,"d":"1.030"},{"v":-1.017579,"d":"-1.018"},{"v":2.966703,"d":"2.967"},{"v":2.853934718333054,"d":"2.854"},-3.2364032863958982,{"v":-4.818393225299779,"d":"-4.818"},{"v":-2.54664917121166,"d":"-2.547"},{"v":2.906763001921945,"d":"2.907"}]
[null,null,"Scottish share of net purchases/(sales) by UK Government at the end of Phase I of EU ETS",{"$nulls":9},{"v":0.182498746811835,"d":"0.182"},{"v":0.182498746811835,"d":"0.182"},{"v":0.182498746811835,"d":"0.182"}]
[null,null,"Scottish share of cancelled allowances by UK Government at the end of Phase II of EU ETS",{"$nulls":12},-0.084,-0.084,-0.084,-0.084,-0.084]
[null,null,"Differences between EU ETS cap and traded emissions for Scotland - adjustment to emisisons",{"$nulls":9},{"$f":"(M7+M6)","v":{"v":0.753037746811835,"d":"0.753"}},{"$f":"(N7+N6)","v":{"v":-3.7690632531881647,"d":"-3.769"}},{"$f":"(O7+O6)","v":{"v":-0.27744725318816477,"d":"-0.277"}},{"$f":"(P8+P6)","v":{"v":-0.858653,"d":"-0.859"}},{"$f":"(Q8+Q6)","v":{"v":0.9455840000000001,"d":"0.946"}},{"$f":"(R8+R6)","v":{"v":-1.101579,"d":"-1.102"}},{"$f":"(S8+S6)","v":{"v":2.882703,"d":"2.883"}},{"$f":"(T8+T6)","v":{"v":2.769934718333054,"d":"2.770"}},{"v":-3.2364032863959,"d":"-3.236"},{"v":-4.81839322529978,"d":"-4.818"},-2.54664917121166,{"v":2.90676300192195,"d":"2.907"}]
[null,"With allowance for EU ETS","Total Scottish greenhouse gas emissions",{"$f":"D4+D9","v":{"v":75.68784905878555,"d":"75.688"}},{"$f":"E4+E9","v":{"v":75.55267192997547,"d":"75.553"}},{"$f":"F4+F9","v":{"v":74.15235157475476,"d":"74.152"}},{"$f":"G4+G9","v":{"v":70.90328943181305,"d":"70.903"}},{"$f":"H4+H9","v":{"v":71.99046284487693,"d":"71.990"}},{"$f":"I4+I9","v":{"v":71.31210533764722,"d":"71.312"}},{"v":67.02675087356991,"d":"67.027"},{"v":66.61594878909973,"d":"66.616"},{"v":64.1232963024878,"d":"64.123"},{"$f":"M4+M9","v":{"v":62.86526404350645,"d":"62.865"}},{"$f":"N4+N9","v":{"v":60.55657398971789,"d":"60.557"}},{"v":59.66830937108004,"d":"59.668"},{"v":57.785240378429144,"d":"57.785"},{"v":55.16305140690079,"d":"55.163"},{"v":54.721617249694525,"d":"54.722"},{"v":52.045624951171305,"d":"52.046"},{"v":54.22680281848274,"d":"54.227"},{"$f":"U4+U9","v":{"v":45.157875766739856,"d":"45.158"}},{"v":39.54108411797707,"d":"39.541"},{"$f":"W4+W9","v":{"v":40.45916676016882,"d":"40.459"}},{"$f":"X4+X9","v":{"v":41.48102179139311,"d":"41.481"}}]
[null,null,"Percentage change from baseline",null,{"$f":"(E10-$D10)/$D10","v":{"v":-1.7859819045072981E-3,"d":"-0.2%"}},{"$f":"(F10-$D10)/$D10","v":{"v":-0.020287239010295936,"d":"-2.0%"}},{"v":-0.06321436910244871,"d":"-6.3%"},{"v":-0.048850459616535204,"d":"-4.9%"},{"v":-0.0578130277918157,"d":"-5.8%"},{"v":-0.11443181822340728,"d":"-11.4%"},{"v":-0.11985940124470722,"d":"-12.0%"},{"v":-0.15279272565026575,"d":"-15.3%"},{"v":-0.169414049609469,"d":"-16.9%"},{"$f":"(N10-$D10)/$D10","v":{"v":-0.1999168328500845,"d":"-20.0%"}},{"v":-0.21165272744457808,"d":"-21.2%"},{"v":-0.2365321369676093,"d":"-23.7%"},{"v":-0.27117691818594913,"d":"-27.1%"},{"v":-0.2770092170647746,"d":"-27.7%"},{"v":-0.31236485646793455,"d":"-31.2%"},{"v":-0.2835467846844789,"d":"-28.4%"},{"v":-0.40336690329690233,"d":"-40.3%"},{"v":-0.4775768553382176,"d":"-47.8%"},{"v":-0.4654470002345445,"d":"-46.5%"},{"v":-0.4519460876847555,"d":"-45.2%"}]

{"sheet":"Chart D1 data","index":40,"n_rows":5,"n_cols":29,"rows_kept":5}
["Scottish Greenhouse Gas Emissions.  Comparison of 1990-2015 and 1990-2016 Inventories. Values in MtCO2e"]
[]
[null,"Baseline Period","1990",1991,1992,1993,1994,1995,1996,1997,"1998","1999","2000","2001","2002",2003,"2004","2005","2006","2007","2008","2009","2010","2011",2012,2013,2014,2015,2016]
["1990-2016",{"$f":"'A1. Headline Chart data'!A4","v":{"v":75.68784905878555,"d":"75.7"}},{"$f":"'A1. Headline Chart data'!B4","v":{"v":75.59583089082136,"d":"75.6"}},{"$nulls":4},{"$f":"'A1. Headline Chart data'!G4","v":{"v":75.55267192997547,"d":"75.6"}},null,null,{"$f":"'A1. Headline Chart data'!J4","v":{"v":74.15235157475476,"d":"74.2"}},{"$f":"'A1. Headline Chart data'!K4","v":{"v":70.90328943181305,"d":"70.9"}},{"$f":"'A1. Headline Chart data'!L4","v":{"v":71.99046284487693,"d":"72.0"}},{"$f":"'A1. Headline Chart data'!M4","v":{"v":71.31210533764722,"d":"71.3"}},{"$f":"'A1. Headline Chart data'!N4","v":{"v":67.02675087356991,"d":"67.0"}},{"$f":"'A1. Headline Chart data'!O4","v":{"v":66.61594878909973,"d":"66.6"}},{"$f":"'A1. Headline Chart data'!P4","v":{"v":64.1232963024878,"d":"64.1"}},{"$f":"'A1. Headline Chart data'!Q4","v":{"v":62.112226296694615,"d":"62.1"}},{"$f":"'A1. Headline Chart data'!R4","v":{"v":64.32563724290605,"d":"64.3"}},{"$f":"'A1. Headline Chart data'!S4","v":{"v":59.945756624268206,"d":"59.9"}},{"$f":"'A1. Headline Chart data'!T4","v":{"v":58.64389337842914,"d":"58.6"}},{"$f":"'A1. Headline Chart data'!U4","v":{"v":54.217467406900795,"d":"54.2"}},{"$f":"'A1. Headline Chart data'!V4","v":{"v":55.823196249694526,"d":"55.8"}},{"$f":"'A1. Headline Chart data'!W4","v":{"v":49.162921951171306,"d":"49.2"}},{"$f":"'A1. Headline Chart data'!X4","v":{"v":51.456868100149684,"d":"51.5"}},{"$f":"'A1. Headline Chart data'!Y4","v":{"v":48.394279053135755,"d":"48.4"}},{"$f":"'A1. Headline Chart data'!Z4","v":{"v":44.35947734327685,"d":"44.4"}},{"$f":"'A1. Headline Chart data'!AA4","v":{"v":43.00581593138048,"d":"43.0"}},{"$f":"'A1. Headline Chart data'!AB4","v":{"v":38.57425878947116,"d":"38.6"}}]
["1990-2015",{"v":77.09056844788263,"d":"77.1"},{"v":76.99854152160906,"d":"77.0"},{"$nulls":4},{"v":77.60394791506619,"d":"77.6"},null,null,{"v":77.3447804933534,"d":"77.3"},{"v":74.00788073432648,"d":"74.0"},{"v":75.83875079427892,"d":"75.8"},{"v":74.83228468164737,"d":"74.8"},{"v":70.06308569722933,"d":"70.1"},{"v":70.3557920623871,"d":"70.4"},{"v":68.22074361604813,"d":"68.2"},{"v":66.85298793535918,"d":"66.9"},{"v":70.01886416884413,"d":"70.0"},{"v":65.4750327637558,"d":"65.5"},{"v":63.27648287943436,"d":"63.3"},{"v":59.00806441621237,"d":"59.0"},{"v":61.79815707538238,"d":"61.8"},{"v":55.49724577733043,"d":"55.5"},{"v":56.284564267095696,"d":"56.3"},{"v":53.72758008691552,"d":"53.7"},{"v":49.51519767558641,"d":"49.5"},{"v":48.051092057793355,"d":"48.1"}]

{"sheet":"Chart D2 data ","index":42,"n_rows":27,"n_cols":6,"rows_kept":27,"merged":[[0,0,0,5]]}
["Revisions to emissions in the Baseline Period, from the 1990-2015 inventory to the 1990-2016 inventory, by source sector.  Values in MtCO2e, and percentage changes"]
[]
[null,"1990-2015","1990-2016","Change between 1990-2015 and 1990-2016","% Change between 1990-2015 and 1990-2016","Contribution to revisions"]
["TOTAL",{"v":77.09056844788263,"d":"77.1"},{"v":75.68784905878555,"d":"75.7"},{"$f":"C4-B4","v":{"v":-1.4027193890970864,"d":"-1.4"}},{"$f":"(C4-B4)/B4","v":{"v":-0.01819573285473177,"d":"-1.8%"}},{"$f":"D4/D$4","v":{"v":1,"d":"100.0%"}}]
["Agriculture and Related Land Use",{"v":14.572192544145226,"d":"14.6"},{"v":13.917607138493755,"d":"13.9"},{"v":-0.6545854056514706,"d":"-0.7"},{"v":-0.04492017269662471,"d":"-4.5%"},{"v":0.4666545645118796,"d":"46.7%"}]
["Forestry",{"v":-5.255431818016718,"d":"-5.3"},{"v":-7.8269278984457396,"d":"-7.8"},{"v":-2.5714960804290214,"d":"-2.6"},{"v":0.4893025291686586,"d":"48.9%"},{"v":1.8332220260277878,"d":"183.3%"}]
["Residential",{"v":8.134195538508012,"d":"8.1"},{"v":8.060449787785258,"d":"8.1"},{"v":-0.07374575072275391,"d":"-0.1"},{"v":-0.009066139407841244,"d":"-0.9%"},{"v":0.052573416533597046,"d":"5.3%"}]
["Waste Management",{"v":5.625670203539032,"d":"5.6"},{"v":6.028898948641075,"d":"6.0"},{"v":0.40322874510204265,"d":"0.4"},{"v":0.07167657017085306,"d":"7.2%"},{"v":-0.2874621597421535,"d":"-28.7%"}]
["Business and Industrial Process",{"v":14.396924874645205,"d":"14.4"},{"v":14.432721492883406,"d":"14.4"},{"v":0.03579661823820146,"d":"0.0"},{"v":2.4864072397324105E-3,"d":"0.2%"},{"v":-0.025519443529787748,"d":"-2.6%"}]
["Public Sector Buildings",{"v":1.6826063117441779,"d":"1.7"},{"v":1.6886004539593495,"d":"1.7"},{"v":0.005994142215171694,"d":"0.0"},{"v":3.5624151492443935E-3,"d":"0.4%"},{"v":-0.004273229743427195,"d":"-0.4%"}]
["Development",{"v":1.8924486108635457,"d":"1.9"},{"v":1.8915056233148553,"d":"1.9"},{"v":-9.4298754869037715E-4,"d":"-0.0"},{"v":-4.982896461638033E-4,"d":"-0.0%"},{"v":6.722567293358417E-4,"d":"0.1%"}]
["Energy Supply",{"v":22.746289017655258,"d":"22.7"},{"v":22.746289017655258,"d":"22.7"},{"v":0,"d":"0.0"},{"v":0,"d":"0.0%"},{"v":0,"d":"0.0%"}]
["Transport (including International Aviation and Shipping)",{"v":13.295673164798883,"d":"13.3"},{"v":13.295673164798883,"d":"13.3"},{"v":0,"d":"0.0"},{"v":0,"d":"0.0%"},{"v":0,"d":"0.0%"}]
[]
[]
["1990-2016"]
["Source Sector","Baseline Period"]
["Total greenhouse gas emissions",{"$f":"'Chart B2 data'!B5","v":{"v":75.68784905878555,"d":"75.7"}}]
["Energy Supply",{"$f":"'Chart B2 data'!B6","v":{"v":22.73372767912457,"d":"22.7"}}]
["Transport (including International Aviation and Shipping)",{"$f":"'Chart B2 data'!B7","v":{"v":14.761265833029025,"d":"14.8"}}]
["Agriculture and Related Land Use",{"$f":"'Chart B2 data'!B10","v":{"v":13.917607138493755,"d":"13.9"}}]
["Business and Industrial process",{"$f":"'Chart B2 data'!B11","v":{"v":14.432721492883406,"d":"14.4"}}]
["Residential",{"$f":"'Chart B2 data'!B12","v":{"v":8.060449787785258,"d":"8.1"}}]
["Waste Management",{"$f":"'Chart B2 data'!B13","v":{"v":6.028898948641075,"d":"6.0"}}]
["        Development",{"$f":"'Chart B2 data'!B15","v":{"v":1.8915056233148553,"d":"1.9"}}]
["        Public Sector Buildings",{"$f":"'Chart B2 data'!B16","v":{"v":1.6886004539593495,"d":"1.7"}}]
["Forestry",{"$f":"'Chart B2 data'!B17","v":{"v":-7.8269278984457396,"d":"-7.8"}}]

{"sheet":"Chart D3 data","index":44,"n_rows":27,"n_cols":6,"rows_kept":27,"merged":[[0,0,0,5]]}
["Revisions to emissions in 2015, from the 1990-2015 inventory to the 1990-2016 inventory, by source sector.  Values in MtCO2e, and percentage changes"]
[]
[null,"1990-2015","1990-2016","Change between 1990-2015 and 1990-2016","% Change between 1990-2015 and 1990-2016","Contribution to revisions"]
["TOTAL",{"v":49.51519767558641,"d":"49.5"},{"$f":"(B18)","v":{"v":43.00581593138048,"d":"43.0"}},{"$f":"C4-B4","v":{"v":-6.509381744205925,"d":"-6.5"}},{"v":-0.10499815738515739,"d":"-10.5%"},{"$f":"D4/D$4","v":{"v":1,"d":"100.0%"}}]
["Agriculture and Related Land Use",{"v":10.990670923758294,"d":"11.0"},{"$f":"(B21)","v":{"v":10.160902316809796,"d":"10.2"}},{"v":-0.8297686069484982,"d":"-0.8"},{"v":-0.060025493861077174,"d":"-6.0%"},{"v":0.12747272161247644,"d":"12.7%"}]
["Forestry",{"v":-7.308211426208517,"d":"-7.3"},{"$f":"(B27)","v":{"v":-12.890693340285708,"d":"-12.9"}},{"v":-5.58248191407719,"d":"-5.6"},{"v":0.8484417355477365,"d":"84.8%"},{"v":0.857605550488143,"d":"85.8%"}]
["Waste Management",{"v":1.4731731398251706,"d":"1.5"},{"$f":"(B24)","v":{"v":1.7258379131087094,"d":"1.7"}},{"v":0.25266477328353876,"d":"0.3"},{"v":0.22147684461887368,"d":"22.1%"},{"v":-0.03881547944371807,"d":"-3.9%"}]
["Energy Supply",{"v":13.866962625564627,"d":"13.9"},{"$f":"(B19)","v":{"v":12.21861147220079,"d":"12.2"}},{"v":-1.648351153363837,"d":"-1.6"},{"v":1.525576065465113E-3,"d":"0.2%"},{"v":0.25322699115489017,"d":"25.3%"}]
["Transport (including International Aviation and Shipping)",{"v":12.9087233182108,"d":"12.9"},{"$f":"(B20)","v":{"v":14.07769135365837,"d":"14.1"}},{"v":1.1689680354475698,"d":"1.2"},{"v":0.07098228970901076,"d":"7.1%"},{"v":-0.1795820373398874,"d":"-18.0%"}]
["Public Sector Buildings",{"v":1.0760128630830967,"d":"1.1"},{"$f":"(B26)","v":{"v":1.0605880145277449,"d":"1.1"}},{"v":-0.015424848555351867,"d":"-0.0"},{"v":4.680188068106458E-3,"d":"0.5%"},{"v":2.3696334247229702E-3,"d":"0.2%"}]
["Residential",{"v":5.923176754539635,"d":"5.9"},{"$f":"(B23)","v":{"v":6.111750932083385,"d":"6.1"}},{"v":0.1885741775437504,"d":"0.2"},{"v":0.001677252771619753,"d":"0.2%"},{"v":-0.02896959879662956,"d":"-2.9%"}]
["Development",{"v":1.7131371125962305,"d":"1.7"},{"$f":"(B25)","v":{"v":1.8723437562961636,"d":"1.9"}},{"v":0.1592066436999331,"d":"0.2"},{"v":0.09652933696258026,"d":"9.7%"},{"v":-0.024458028420540054,"d":"-2.4%"}]
["Business and Industrial Process",{"v":8.68949980712217,"d":"8.7"},{"$f":"(B22)","v":{"v":8.668783512981232,"d":"8.7"}},{"v":-0.020716294140937563,"d":"-0.0"},{"v":0.008831187506184552,"d":"0.9%"},{"v":0.003182528687824673,"d":"0.3%"}]
[]
[]
["1990-2016"]
["Source Sector","Baseline Period"]
["Total greenhouse gas emissions",{"$f":"'Chart B2 data'!V5","v":{"v":43.00581593138048,"d":"43.0"}}]
["Energy Supply",{"$f":"'Chart B2 data'!V6","v":{"v":12.21861147220079,"d":"12.2"}}]
["Transport (including International Aviation and Shipping)",{"$f":"'Chart B2 data'!V7","v":{"v":14.07769135365837,"d":"14.1"}}]
["Agriculture and Related Land Use",{"$f":"'Chart B2 data'!V10","v":{"v":10.160902316809796,"d":"10.2"}}]
["Business and Industrial process",{"$f":"'Chart B2 data'!V11","v":{"v":8.668783512981232,"d":"8.7"}}]
["Residential",{"$f":"'Chart B2 data'!V12","v":{"v":6.111750932083385,"d":"6.1"}}]
["Waste Management",{"$f":"'Chart B2 data'!V13","v":{"v":1.7258379131087094,"d":"1.7"}}]
["        Development",{"$f":"'Chart B2 data'!V15","v":{"v":1.8723437562961636,"d":"1.9"}}]
["        Public Sector Buildings",{"$f":"'Chart B2 data'!V16","v":{"v":1.0605880145277449,"d":"1.1"}}]
["Forestry",{"$f":"'Chart B2 data'!V17","v":{"v":-12.890693340285708,"d":"-12.9"}}]

{"sheet":"Chart D4 data","index":46,"n_rows":103,"n_cols":23,"rows_kept":103}
["Scottish Greenhouse Gas Emissions by Source Sector, Successive Inventories from 1990-2008 to 1990-2016. Values in Mt CO2e"]
[]
[null,"Baseline Period","1990","1995","1998","1999","2000","2001","2002","2003","2004","2005","2006","2007","2008","2009","2010","2011",2012,2013,2014,2015,2016]
["Total"]
["1990-2008",{"v":70.20120874203604,"d":"70.2"},{"v":70.08861704602371,"d":"70.1"},{"v":67.76163721875093,"d":"67.8"},{"v":67.68051310799292,"d":"67.7"},{"v":63.308517821525996,"d":"63.3"},{"v":65.45695192451285,"d":"65.5"},{"v":64.79840940895612,"d":"64.8"},{"v":60.91428754134762,"d":"60.9"},{"v":60.50633074831477,"d":"60.5"},{"v":58.46020024549399,"d":"58.5"},{"v":57.80071464644466,"d":"57.8"},{"v":61.54783927669467,"d":"61.5"},{"v":57.7850670945085,"d":"57.8"},{"v":56.07974922107974,"d":"56.1"}]
["1990-2009",{"v":71.75464265859955,"d":"71.8"},{"v":71.64375052754623,"d":"71.6"},{"v":68.55864901612834,"d":"68.6"},{"v":68.53561939349161,"d":"68.5"},{"v":64.34400890312328,"d":"64.3"},{"v":66.04881235487686,"d":"66.0"},{"v":65.37381920117474,"d":"65.4"},{"v":61.17059719007449,"d":"61.2"},{"v":60.667907339351245,"d":"60.7"},{"v":58.45503242721944,"d":"58.5"},{"v":57.48164864849206,"d":"57.5"},{"v":61.16708082177484,"d":"61.2"},{"v":56.917424332893354,"d":"56.9"},{"v":54.79947792663309,"d":"54.8"},{"v":50.951114766147754,"d":"51.0"}]
["1990-2010",{"v":72.27573351999374,"d":"72.3"},{"v":72.18000900342969,"d":"72.2"},{"v":69.7511213183096,"d":"69.8"},{"v":70.03904835658753,"d":"70.0"},{"v":65.841387554759,"d":"65.8"},{"v":67.49309761499309,"d":"67.5"},{"v":66.98156270949838,"d":"67.0"},{"v":62.574217186317995,"d":"62.6"},{"v":62.018278734718265,"d":"62.0"},{"v":59.816952075037285,"d":"59.8"},{"v":58.708560376980806,"d":"58.7"},{"v":62.59380382284063,"d":"62.6"},{"v":58.34115418192856,"d":"58.3"},{"v":56.56546206844203,"d":"56.6"},{"v":52.65749722649967,"d":"52.7"},{"v":55.73148614008558,"d":"55.7"}]
["1990-2011",{"v":72.97425805362829,"d":"73.0"},{"v":72.87853353706421,"d":"72.9"},{"v":70.94624399002544,"d":"70.9"},{"v":70.34475789672638,"d":"70.3"},{"v":66.84076763151802,"d":"66.8"},{"v":68.97282998871907,"d":"69.0"},{"v":68.2484689520323,"d":"68.2"},{"v":63.78253149784052,"d":"63.8"},{"v":63.32151749656761,"d":"63.3"},{"v":61.14416457889385,"d":"61.1"},{"v":60.33767418940584,"d":"60.3"},{"v":63.88241573024165,"d":"63.9"},{"v":59.41796407523621,"d":"59.4"},{"v":58.1054606313283,"d":"58.1"},{"v":54.20553281725284,"d":"54.2"},{"v":56.91045527912781,"d":"56.9"},{"v":51.28520737170522,"d":"51.3"}]
["1990-2012",{"v":75.58933742616752,"d":"75.6"},{"v":75.49343578296897,"d":"75.5"},{"v":75.36120510735076,"d":"75.4"},{"v":74.24731143211154,"d":"74.2"},{"v":70.29238798006844,"d":"70.3"},{"v":72.03235734632767,"d":"72.0"},{"v":71.34521358143834,"d":"71.3"},{"v":66.96191625488605,"d":"67.0"},{"v":66.67322973864466,"d":"66.7"},{"v":64.37123609518308,"d":"64.4"},{"v":63.06944069280411,"d":"63.1"},{"v":66.7652170994855,"d":"66.8"},{"v":62.17583667336196,"d":"62.2"},{"v":60.18562760985603,"d":"60.2"},{"v":56.315659349014716,"d":"56.3"},{"v":58.31763160669141,"d":"58.3"},{"v":52.48724288253631,"d":"52.5"},{"v":52.89524485922636,"d":"52.9"}]
["1990-2013",{"v":80.78616423397557,"d":"80.8"},{"v":80.6712601125667,"d":"80.7"},{"v":81.1585299429733,"d":"81.2"},{"v":80.12155808758715,"d":"80.1"},{"v":76.49571904456603,"d":"76.5"},{"v":77.97396180119168,"d":"78.0"},{"v":76.98912792149055,"d":"77.0"},{"v":72.42879329447685,"d":"72.4"},{"v":72.27155906561745,"d":"72.3"},{"v":69.87806877687754,"d":"69.9"},{"v":68.42843805622019,"d":"68.4"},{"v":71.43265770236209,"d":"71.4"},{"v":66.61810394354998,"d":"66.6"},{"v":64.29032075308338,"d":"64.3"},{"v":59.78439792748278,"d":"59.8"},{"v":61.51118201942635,"d":"61.5"},{"v":54.84274542604149,"d":"54.8"},{"v":54.93955581480357,"d":"54.9"},{"v":52.9612103203809,"d":"53.0"}]
["1990-2014",{"v":77.25735481831401,"d":"77.3"},{"v":77.16485306880288,"d":"77.2"},{"v":77.59977138959944,"d":"77.6"},{"v":76.89059371118506,"d":"76.9"},{"v":73.05058042604873,"d":"73.1"},{"v":74.71240433263148,"d":"74.7"},{"v":73.87881779339125,"d":"73.9"},{"v":69.4894772078493,"d":"69.5"},{"v":69.50552460778789,"d":"69.5"},{"v":67.19605789273501,"d":"67.2"},{"v":65.85556994191501,"d":"65.9"},{"v":68.98903807877157,"d":"69.0"},{"v":64.16331059246492,"d":"64.2"},{"v":61.86661244872619,"d":"61.9"},{"v":57.24694127415563,"d":"57.2"},{"v":58.99760351763261,"d":"59.0"},{"v":52.25294499801854,"d":"52.3"},{"v":52.71067419284515,"d":"52.7"},{"v":51.12172999637693,"d":"51.1"},{"v":46.7041295417371,"d":"46.7"}]
["1990-2015",{"v":77.09056844788263,"d":"77.1"},{"v":76.99854152160904,"d":"77.0"},{"v":77.60394791506619,"d":"77.6"},{"v":77.3447804933534,"d":"77.3"},{"v":74.00788073432649,"d":"74.0"},{"v":75.83875079427892,"d":"75.8"},{"v":74.83228468164735,"d":"74.8"},{"v":70.06308569722934,"d":"70.1"},{"v":70.3557920623871,"d":"70.4"},{"v":68.22074361604811,"d":"68.2"},{"v":66.85298793535918,"d":"66.9"},{"v":70.01886416884413,"d":"70.0"},{"v":65.47503276375582,"d":"65.5"},{"v":63.27648287943437,"d":"63.3"},{"v":59.008064416212356,"d":"59.0"},{"v":61.79815707538236,"d":"61.8"},{"v":55.49724577733043,"d":"55.5"},{"v":56.284564267095696,"d":"56.3"},{"v":53.727580086915516,"d":"53.7"},{"v":49.51519767558641,"d":"49.5"},{"v":48.051092057793355,"d":"48.1"}]
["1990-2016",{"v":75.68784905878555,"d":"75.7"},{"v":75.59583089082136,"d":"75.6"},{"v":75.55267192997547,"d":"75.6"},{"v":74.15235157475476,"d":"74.2"},{"v":70.90328943181305,"d":"70.9"},{"v":71.99046284487693,"d":"72.0"},{"v":71.31210533764722,"d":"71.3"},{"v":67.02675087356991,"d":"67.0"},{"v":66.61594878909973,"d":"66.6"},{"v":64.1232963024878,"d":"64.1"},{"v":62.112226296694615,"d":"62.1"},{"v":64.32563724290605,"d":"64.3"},{"v":59.945756624268206,"d":"59.9"},{"v":58.64389337842914,"d":"58.6"},{"v":54.217467406900795,"d":"54.2"},{"v":55.823196249694526,"d":"55.8"},{"v":49.162921951171306,"d":"49.2"},{"v":51.456868100149684,"d":"51.5"},{"v":48.394279053135755,"d":"48.4"},{"v":44.35947734327685,"d":"44.4"},{"v":43.00581593138048,"d":"43.0"},{"v":38.57425878947116,"d":"38.6"}]
["Energy Supply"]
["1990-2008",{"v":22.34657789146354,"d":"22.3"},{"v":22.34657789146354,"d":"22.3"},{"v":26.452620917266895,"d":"26.5"},{"v":26.151854795738576,"d":"26.2"},{"v":22.95038233214515,"d":"23.0"},{"v":25.807478513240653,"d":"25.8"},{"v":25.162578987668844,"d":"25.2"},{"v":23.202908991298955,"d":"23.2"},{"v":23.103410632671203,"d":"23.1"},{"v":21.3076573444668,"d":"21.3"},{"v":20.14592622952496,"d":"20.1"},{"v":23.795298314812438,"d":"23.8"},{"v":20.6749966306049,"d":"20.7"},{"v":19.431580020360244,"d":"19.4"}]
["1990-2009",{"v":22.23876877438226,"d":"22.2"},{"v":22.23876877438226,"d":"22.2"},{"v":26.37274260286119,"d":"26.4"},{"v":26.2152578751963,"d":"26.2"},{"v":23.074524459147213,"d":"23.1"},{"v":25.87394759878063,"d":"25.9"},{"v":25.26461308334705,"d":"25.3"},{"v":23.341077974166286,"d":"23.3"},{"v":23.43447473380097,"d":"23.4"},{"v":21.63676896024091,"d":"21.6"},{"v":20.513729206481727,"d":"20.5"},{"v":24.351758339101018,"d":"24.4"},{"v":21.07093723947801,"d":"21.1"},{"v":19.640011019957274,"d":"19.6"},{"v":18.211053644700378,"d":"18.2"}]
["1990-2010",{"v":22.32284882415959,"d":"22.3"},{"v":22.32284882415959,"d":"22.3"},{"v":26.469287464303,"d":"26.5"},{"v":26.332518872573186,"d":"26.3"},{"v":23.18260767777863,"d":"23.2"},{"v":25.981765209410266,"d":"26.0"},{"v":25.462870044529833,"d":"25.5"},{"v":23.430345750517812,"d":"23.4"},{"v":23.42232399649962,"d":"23.4"},{"v":21.749064122602086,"d":"21.7"},{"v":20.485356423857,"d":"20.5"},{"v":24.669881372688476,"d":"24.7"},{"v":21.29843190043817,"d":"21.3"},{"v":19.833896549821755,"d":"19.8"},{"v":18.535075335709752,"d":"18.5"},{"v":20.74437467894045,"d":"20.7"}]
["1990-2011",{"v":22.406463736682834,"d":"22.4"},{"v":22.406463736682834,"d":"22.4"},{"v":26.483468866480507,"d":"26.5"},{"v":25.500152723867753,"d":"25.5"},{"v":23.145213446240607,"d":"23.1"},{"v":26.03512021036474,"d":"26.0"},{"v":25.33297856560135,"d":"25.3"},{"v":23.276285877851524,"d":"23.3"},{"v":23.438884554476992,"d":"23.4"},{"v":21.777474386878872,"d":"21.8"},{"v":20.40431501632692,"d":"20.4"},{"v":24.44200092237828,"d":"24.4"},{"v":21.06892548467998,"d":"21.1"},{"v":19.949905780865873,"d":"19.9"},{"v":18.5579919303097,"d":"18.6"},{"v":20.742542765376033,"d":"20.7"},{"v":16.92948227633036,"d":"16.9"}]
["1990-2012",{"v":22.398532513669974,"d":"22.4"},{"v":22.39853251366997,"d":"22.4"},{"v":26.48057615789694,"d":"26.5"},{"v":25.497503046727857,"d":"25.5"},{"v":23.13575250339771,"d":"23.1"},{"v":26.033111727871173,"d":"26.0"},{"v":25.331309351058767,"d":"25.3"},{"v":23.274693486633414,"d":"23.3"},{"v":23.437391318910088,"d":"23.4"},{"v":21.77452025691538,"d":"21.8"},{"v":20.511522600748123,"d":"20.5"},{"v":24.741041732758394,"d":"24.7"},{"v":21.319211789732304,"d":"21.3"},{"v":19.978234854688868,"d":"20.0"},{"v":18.583073908221156,"d":"18.6"},{"v":20.729684094215493,"d":"20.7"},{"v":16.89532719230045,"d":"16.9"},{"v":17.12869570626498,"d":"17.1"}]
["1990-2013",{"v":22.729090373229383,"d":"22.7"},{"v":22.729090373229393,"d":"22.7"},{"v":26.78619083628695,"d":"26.8"},{"v":25.733552740552266,"d":"25.7"},{"v":23.281588048686135,"d":"23.3"},{"v":26.211736358232685,"d":"26.2"},{"v":25.53135533986343,"d":"25.5"},{"v":23.450729112161312,"d":"23.5"},{"v":23.60793718286749,"d":"23.6"},{"v":21.83793280346331,"d":"21.8"},{"v":20.76232691337347,"d":"20.8"},{"v":24.696241754364042,"d":"24.7"},{"v":21.38541675143506,"d":"21.4"},{"v":20.01693316877879,"d":"20.0"},{"v":18.71574292463952,"d":"18.7"},{"v":20.866704864816825,"d":"20.9"},{"v":17.04438018680949,"d":"17.0"},{"v":17.493398432724614,"d":"17.5"},{"v":16.016617205667067,"d":"16.0"}]
["1990-2014",{"v":22.77390519376167,"d":"22.8"},{"v":22.773905193761674,"d":"22.8"},{"v":26.845456428578377,"d":"26.8"},{"v":25.812259115235598,"d":"25.8"},{"v":23.33809941305072,"d":"23.3"},{"v":26.282260365517658,"d":"26.3"},{"v":25.55414729414758,"d":"25.6"},{"v":23.4989147852884,"d":"23.5"},{"v":23.663222505562096,"d":"23.7"},{"v":21.879857629780282,"d":"21.9"},{"v":20.738713263238278,"d":"20.7"},{"v":24.742848902572437,"d":"24.7"},{"v":21.396037508531393,"d":"21.4"},{"v":20.154398748130507,"d":"20.2"},{"v":18.758495713781354,"d":"18.8"},{"v":20.867611486037895,"d":"20.9"},{"v":16.999735749091496,"d":"17.0"},{"v":17.49335638540693,"d":"17.5"},{"v":15.983322948959879,"d":"16.0"},{"v":13.847812496941488,"d":"13.8"}]
["1990-2015",{"v":22.746289017655258,"d":"22.7"},{"v":22.74628901765527,"d":"22.7"},{"v":26.773950830053213,"d":"26.8"},{"v":25.780724278592032,"d":"25.8"},{"v":23.358887535134897,"d":"23.4"},{"v":26.296480091615116,"d":"26.3"},{"v":25.61860334570779,"d":"25.6"},{"v":23.545185820250367,"d":"23.5"},{"v":23.711116488007498,"d":"23.7"},{"v":21.932307185588414,"d":"21.9"},{"v":20.783207196524412,"d":"20.8"},{"v":24.75733518254558,"d":"24.8"},{"v":21.435846452025405,"d":"21.4"},{"v":20.07945754069543,"d":"20.1"},{"v":18.683596904476154,"d":"18.7"},{"v":20.818487705037768,"d":"20.8"},{"v":17.01712345806483,"d":"17.0"},{"v":17.481619255096877,"d":"17.5"},{"v":15.976560512964477,"d":"16.0"},{"v":13.866962625564627,"d":"13.9"},{"v":12.199999445048736,"d":"12.2"}]
["1990-2016",{"v":22.73372767912457,"d":"22.7"},{"v":22.73372767912457,"d":"22.7"},{"v":26.755699086839662,"d":"26.8"},{"v":25.788610983405242,"d":"25.8"},{"v":23.356719562169157,"d":"23.4"},{"v":26.283172097086126,"d":"26.3"},{"v":25.614008443918227,"d":"25.6"},{"v":23.535452573019434,"d":"23.5"},{"v":23.706476063245237,"d":"23.7"},{"v":21.92646666090184,"d":"21.9"},{"v":20.772660146843794,"d":"20.8"},{"v":24.655482335676677,"d":"24.7"},{"v":21.408253674659395,"d":"21.4"},{"v":20.078605453549482,"d":"20.1"},{"v":18.686940935430314,"d":"18.7"},{"v":20.88647136600246,"d":"20.9"},{"v":17.021587052855402,"d":"17.0"},{"v":17.41930233604674,"d":"17.4"},{"v":15.965981393105,"d":"16.0"},{"v":13.862349033189185,"d":"13.9"},{"v":12.21861147220079,"d":"12.2"},{"v":7.159352393156618,"d":"7.2"}]
["Agriculture and Related Land Use"]
["1990-2008",{"v":13.82678872153848,"d":"13.8"},{"v":13.82678872153848,"d":"13.8"},{"v":13.696087925463228,"d":"13.7"},{"v":13.286747473123858,"d":"13.3"},{"v":13.143766399917268,"d":"13.1"},{"v":12.815161290402168,"d":"12.8"},{"v":12.530528720517749,"d":"12.5"},{"v":12.516555929121644,"d":"12.5"},{"v":12.610777848699344,"d":"12.6"},{"v":12.337325294945273,"d":"12.3"},{"v":12.257783221544551,"d":"12.3"},{"v":12.118689805784191,"d":"12.1"},{"v":11.804267053906127,"d":"11.8"},{"v":11.545635520843327,"d":"11.5"}]
["1990-2009",{"v":14.505423841711117,"d":"14.5"},{"v":14.505423841711117,"d":"14.5"},{"v":14.36903017606574,"d":"14.4"},{"v":14.114350277527366,"d":"14.1"},{"v":13.978592518604815,"d":"14.0"},{"v":13.419880291699016,"d":"13.4"},{"v":12.929277196548115,"d":"12.9"},{"v":12.732252700419576,"d":"12.7"},{"v":12.629730708014284,"d":"12.6"},{"v":12.14918352343901,"d":"12.1"},{"v":11.879050310588044,"d":"11.9"},{"v":11.590391057873326,"d":"11.6"},{"v":11.138099141375264,"d":"11.1"},{"v":10.738081762515655,"d":"10.7"},{"v":10.629294974987651,"d":"10.6"}]
["1990-2010",{"v":14.261297658479855,"d":"14.3"},{"v":14.261297658479855,"d":"14.3"},{"v":14.448262538611047,"d":"14.4"},{"v":14.434890510243093,"d":"14.4"},{"v":14.304870070325755,"d":"14.3"},{"v":13.646357106276065,"d":"13.6"},{"v":13.196180759286747,"d":"13.2"},{"v":13.080940259178305,"d":"13.1"},{"v":13.12953797723239,"d":"13.1"},{"v":12.623581276548347,"d":"12.6"},{"v":12.098467183643772,"d":"12.1"},{"v":11.865283171895483,"d":"11.9"},{"v":11.32455663481353,"d":"11.3"},{"v":10.931365600196589,"d":"10.9"},{"v":10.742791244587751,"d":"10.7"},{"v":10.462771294837092,"d":"10.5"}]
["1990-2011",{"v":14.344142999887778,"d":"14.3"},{"v":14.344142999887778,"d":"14.3"},{"v":14.432229872658759,"d":"14.4"},{"v":14.483084843306202,"d":"14.5"},{"v":14.325220718803774,"d":"14.3"},{"v":13.705482226955212,"d":"13.7"},{"v":13.166478746110071,"d":"13.2"},{"v":12.957022698323279,"d":"13.0"},{"v":12.958528429169522,"d":"13.0"},{"v":12.578073984182243,"d":"12.6"},{"v":12.220170257094178,"d":"12.2"},{"v":11.767706579984427,"d":"11.8"},{"v":11.282385576860946,"d":"11.3"},{"v":10.85453644901068,"d":"10.9"},{"v":10.653427656644983,"d":"10.7"},{"v":10.418917197811329,"d":"10.4"},{"v":10.137550550245379,"d":"10.1"}]
["1990-2012",{"v":15.239934260969623,"d":"15.2"},{"v":15.239934260969623,"d":"15.2"},{"v":15.395314337041485,"d":"15.4"},{"v":15.547425244578264,"d":"15.5"},{"v":15.331634159547933,"d":"15.3"},{"v":15.080890142386988,"d":"15.1"},{"v":14.531522043278345,"d":"14.5"},{"v":14.32209148927089,"d":"14.3"},{"v":14.310516393963635,"d":"14.3"},{"v":13.918303880455312,"d":"13.9"},{"v":13.572456108102394,"d":"13.6"},{"v":13.136106261585478,"d":"13.1"},{"v":12.650667977812027,"d":"12.7"},{"v":12.216389485612064,"d":"12.2"},{"v":11.999227224754081,"d":"12.0"},{"v":11.783561401278662,"d":"11.8"},{"v":11.483919140876061,"d":"11.5"},{"v":11.165736837268218,"d":"11.2"}]
["1990-2013",{"v":16.114005759740426,"d":"16.1"},{"v":16.114005759740426,"d":"16.1"},{"v":16.29658490038525,"d":"16.3"},{"v":16.300639765948578,"d":"16.3"},{"v":16.141703979951103,"d":"16.1"},{"v":16.065386352975146,"d":"16.1"},{"v":15.496206661319144,"d":"15.5"},{"v":15.200084591868906,"d":"15.2"},{"v":15.317252021108729,"d":"15.3"},{"v":14.914976002715775,"d":"14.9"},{"v":14.608513512853868,"d":"14.6"},{"v":14.168580418629485,"d":"14.2"},{"v":13.847783052065584,"d":"13.8"},{"v":13.30941172748837,"d":"13.3"},{"v":13.31127097831766,"d":"13.3"},{"v":13.165938246945345,"d":"13.2"},{"v":12.733985338510955,"d":"12.7"},{"v":12.539143969385098,"d":"12.5"},{"v":12.395561735359877,"d":"12.4"}]
["1990-2014",{"v":14.234694013339578,"d":"14.2"},{"v":14.234694013339572,"d":"14.2"},{"v":14.46173738031394,"d":"14.5"},{"v":14.45276001747625,"d":"14.5"},{"v":14.083613138758306,"d":"14.1"},{"v":14.013660577750478,"d":"14.0"},{"v":13.492455666621128,"d":"13.5"},{"v":13.196738209121472,"d":"13.2"},{"v":13.34214135280393,"d":"13.3"},{"v":12.921520041091682,"d":"12.9"},{"v":12.62374231206269,"d":"12.6"},{"v":12.218032200346203,"d":"12.2"},{"v":11.93307248310506,"d":"11.9"},{"v":11.405457514083556,"d":"11.4"},{"v":11.437191072941143,"d":"11.4"},{"v":11.298997487076818,"d":"11.3"},{"v":10.872173417949817,"d":"10.9"},{"v":10.736394833211104,"d":"10.7"},{"v":10.854768924493426,"d":"10.9"},{"v":10.669055309764737,"d":"10.7"}]
["1990-2015",{"v":14.572192544145226,"d":"14.6"},{"v":14.572192544145219,"d":"14.6"},{"v":14.801731577247223,"d":"14.8"},{"v":14.787675777326582,"d":"14.8"},{"v":14.501888744799217,"d":"14.5"},{"v":14.400025598434,"d":"14.4"},{"v":13.897361735170215,"d":"13.9"},{"v":13.609921506727375,"d":"13.6"},{"v":13.763223107758272,"d":"13.8"},{"v":13.352479873819288,"d":"13.4"},{"v":13.04060239391109,"d":"13.0"},{"v":12.640186937352945,"d":"12.6"},{"v":12.346366330420697,"d":"12.3"},{"v":11.820757594208972,"d":"11.8"},{"v":11.855859420015832,"d":"11.9"},{"v":11.724460863892114,"d":"11.7"},{"v":11.275179518646661,"d":"11.3"},{"v":11.143518345412117,"d":"11.1"},{"v":11.209565123727876,"d":"11.2"},{"v":10.990670923758294,"d":"11.0"},{"v":10.809763722791939,"d":"10.8"}]
["1990-2016",{"v":13.917607138493755,"d":"13.9"},{"v":13.917607138493755,"d":"13.9"},{"v":14.133385634275069,"d":"14.1"},{"v":14.02439821965809,"d":"14.0"},{"v":13.911501751229613,"d":"13.9"},{"v":13.677067182912207,"d":"13.7"},{"v":13.23211059560179,"d":"13.2"},{"v":12.882190888854105,"d":"12.9"},{"v":12.97123441484144,"d":"13.0"},{"v":12.536972169701311,"d":"12.5"},{"v":12.285958653053973,"d":"12.3"},{"v":11.918420157739302,"d":"11.9"},{"v":11.904224975395497,"d":"11.9"},{"v":11.242305809347823,"d":"11.2"},{"v":11.174535345263054,"d":"11.2"},{"v":11.115648481086849,"d":"11.1"},{"v":10.713281024730195,"d":"10.7"},{"v":10.514074756344565,"d":"10.5"},{"v":10.428899147401482,"d":"10.4"},{"v":10.44587060441735,"d":"10.4"},{"v":10.160902316809796,"d":"10.2"},{"v":10.049052861385226,"d":"10.0"}]
["Business and Industrial Process"]
["1990-2008",{"v":12.399391047209336,"d":"12.4"},{"v":12.32105494451496,"d":"12.3"},{"v":7.982307277899399,"d":"8.0"},{"v":8.234074382963643,"d":"8.2"},{"v":8.308754583355974,"d":"8.3"},{"v":8.540542784010142,"d":"8.5"},{"v":9.096729200340919,"d":"9.1"},{"v":8.295446528999397,"d":"8.3"},{"v":8.226193442926347,"d":"8.2"},{"v":8.103456436748056,"d":"8.1"},{"v":8.533910123240103,"d":"8.5"},{"v":8.32745993111707,"d":"8.3"},{"v":8.066783411466087,"d":"8.1"},{"v":7.734657709889325,"d":"7.7"}]
["1990-2009",{"v":12.418001362927239,"d":"12.4"},{"v":12.341364825191885,"d":"12.3"},{"v":8.01792653205945,"d":"8.0"},{"v":8.246080975153125,"d":"8.2"},{"v":8.314706777200211,"d":"8.3"},{"v":8.55520881768693,"d":"8.6"},{"v":9.137406467014983,"d":"9.1"},{"v":8.307018557672103,"d":"8.3"},{"v":8.250960724847282,"d":"8.3"},{"v":8.108708070303196,"d":"8.1"},{"v":8.44485029624435,"d":"8.4"},{"v":8.22986605565814,"d":"8.2"},{"v":7.886196635051986,"d":"7.9"},{"v":7.685803070337119,"d":"7.7"},{"v":6.756325295037405,"d":"6.8"}]
["1990-2010",{"v":13.206676779098816,"d":"13.2"},{"v":13.14514914769541,"d":"13.1"},{"v":8.682535881362654,"d":"8.7"},{"v":8.810236419098926,"d":"8.8"},{"v":8.893486724028023,"d":"8.9"},{"v":9.180741175819213,"d":"9.2"},{"v":9.749936237195737,"d":"9.7"},{"v":8.922059302162943,"d":"8.9"},{"v":8.880000505615644,"d":"8.9"},{"v":8.715459674873765,"d":"8.7"},{"v":9.155047287444484,"d":"9.2"},{"v":8.878196475810173,"d":"8.9"},{"v":8.648599443578311,"d":"8.6"},{"v":8.88632577063652,"d":"8.9"},{"v":7.769540864901421,"d":"7.8"},{"v":7.8930126948438755,"d":"7.9"}]
["1990-2011",{"v":13.635518356909635,"d":"13.6"},{"v":13.573990725506228,"d":"13.6"},{"v":9.453883095029052,"d":"9.5"},{"v":9.731355707640033,"d":"9.7"},{"v":9.84555667293495,"d":"9.8"},{"v":10.427297115232374,"d":"10.4"},{"v":11.00066954421481,"d":"11.0"},{"v":10.197875103822957,"d":"10.2"},{"v":10.102191775790972,"d":"10.1"},{"v":9.93543505552494,"d":"9.9"},{"v":10.59893578080142,"d":"10.6"},{"v":10.157478118939295,"d":"10.2"},{"v":9.74219546699916,"d":"9.7"},{"v":10.1854396512795,"d":"10.2"},{"v":9.090685812881066,"d":"9.1"},{"v":9.145145010390685,"d":"9.1"},{"v":9.231181388613791,"d":"9.2"}]
["1990-2012",{"v":13.599797462653386,"d":"13.6"},{"v":13.538171316304679,"d":"13.5"},{"v":9.348212679206512,"d":"9.3"},{"v":9.461334559800447,"d":"9.5"},{"v":9.561820168247955,"d":"9.6"},{"v":9.903555654029848,"d":"9.9"},{"v":10.385144531659318,"d":"10.4"},{"v":9.428906449466114,"d":"9.4"},{"v":9.497883724283575,"d":"9.5"},{"v":9.39152684113599,"d":"9.4"},{"v":9.787514619142364,"d":"9.8"},{"v":9.516508684776023,"d":"9.5"},{"v":9.113782218115139,"d":"9.1"},{"v":9.05964676901934,"d":"9.1"},{"v":8.074654597011047,"d":"8.1"},{"v":8.156951751221934,"d":"8.2"},{"v":8.476111209076391,"d":"8.5"},{"v":8.527106434432696,"d":"8.5"}]
["1990-2013",{"v":14.35533277025789,"d":"14.4"},{"v":14.298403848700538,"d":"14.3"},{"v":10.96359084572529,"d":"11.0"},{"v":11.063888776317912,"d":"11.1"},{"v":11.277749561278071,"d":"11.3"},{"v":11.17480636979848,"d":"11.2"},{"v":11.49405221735847,"d":"11.5"},{"v":10.672653437811794,"d":"10.7"},{"v":10.82551740445682,"d":"10.8"},{"v":10.746128083282398,"d":"10.7"},{"v":11.02874090689432,"d":"11.0"},{"v":10.754339202983283,"d":"10.8"},{"v":10.296483581911398,"d":"10.3"},{"v":10.424972832849928,"d":"10.4"},{"v":9.090471197199273,"d":"9.1"},{"v":9.270974649032457,"d":"9.3"},{"v":9.163567539159157,"d":"9.2"},{"v":8.872630886336763,"d":"8.9"},{"v":9.102074879445595,"d":"9.1"}]
["1990-2014",{"v":14.347485480263956,"d":"14.3"},{"v":14.312958930604356,"d":"14.3"},{"v":10.975469969476404,"d":"11.0"},{"v":11.075231578550257,"d":"11.1"},{"v":11.287245776707556,"d":"11.3"},{"v":11.178544557630525,"d":"11.2"},{"v":11.50396315522195,"d":"11.5"},{"v":10.68479630824204,"d":"10.7"},{"v":10.838130583738543,"d":"10.8"},{"v":10.761230509328406,"d":"10.8"},{"v":11.083223900091557,"d":"11.1"},{"v":10.817540164495526,"d":"10.8"},{"v":10.366155416580215,"d":"10.4"},{"v":10.472414739560913,"d":"10.5"},{"v":9.15497786110579,"d":"9.2"},{"v":9.341642540040233,"d":"9.3"},{"v":9.066701474431005,"d":"9.1"},{"v":8.883713280632163,"d":"8.9"},{"v":9.191166852111992,"d":"9.2"},{"v":8.650633470440864,"d":"8.7"}]
["1990-2015",{"v":14.396924874645205,"d":"14.4"},{"v":14.362873282587813,"d":"14.4"},{"v":11.041314083455704,"d":"11.0"},{"v":11.19617719538614,"d":"11.2"},{"v":11.416608660153525,"d":"11.4"},{"v":11.285544552455018,"d":"11.3"},{"v":11.629290223846033,"d":"11.6"},{"v":10.814159312242449,"d":"10.8"},{"v":11.020803620611803,"d":"11.0"},{"v":10.959712362154697,"d":"11.0"},{"v":11.30340123429865,"d":"11.3"},{"v":11.057957186915308,"d":"11.1"},{"v":10.628427288113304,"d":"10.6"},{"v":10.689953447555924,"d":"10.7"},{"v":9.375630411330983,"d":"9.4"},{"v":9.70797370204125,"d":"9.7"},{"v":9.225738956709995,"d":"9.2"},{"v":8.970715743706979,"d":"9.0"},{"v":9.203051572035223,"d":"9.2"},{"v":8.68949980712217,"d":"8.7"},{"v":8.592898019350823,"d":"8.6"}]
["1990-2016",{"v":14.432721492883406,"d":"14.4"},{"v":14.398678659135406,"d":"14.4"},{"v":11.183617991493792,"d":"11.2"},{"v":11.162865544929277,"d":"11.2"},{"v":11.386777782811475,"d":"11.4"},{"v":11.294899480726873,"d":"11.3"},{"v":11.603871427536028,"d":"11.6"},{"v":10.787847931207768,"d":"10.8"},{"v":10.992339139273202,"d":"11.0"},{"v":10.93663811515521,"d":"10.9"},{"v":10.562717434177497,"d":"10.6"},{"v":10.295558719191853,"d":"10.3"},{"v":9.947878979737625,"d":"9.9"},{"v":10.440119552250032,"d":"10.4"},{"v":9.212970243104953,"d":"9.2"},{"v":9.419196523576844,"d":"9.4"},{"v":9.109260811370149,"d":"9.1"},{"v":9.002199572749303,"d":"9.0"},{"v":9.185229427597813,"d":"9.2"},{"v":8.670951233491797,"d":"8.7"},{"v":8.668783512981232,"d":"8.7"},{"v":8.56959345960452,"d":"8.6"}]
["Residential"]
["1990-2008",{"v":7.788516298586483,"d":"7.8"},{"v":7.754260705268527,"d":"7.8"},{"v":7.918102593751752,"d":"7.9"},{"v":8.199656726756588,"d":"8.2"},{"v":7.965109296555246,"d":"8.0"},{"v":7.945346973221898,"d":"7.9"},{"v":8.298823538301908,"d":"8.3"},{"v":7.773040869723515,"d":"7.8"},{"v":7.761714649728432,"d":"7.8"},{"v":7.806196636443263,"d":"7.8"},{"v":7.660372009577432,"d":"7.7"},{"v":7.397999729932821,"d":"7.4"},{"v":7.242118353490998,"d":"7.2"},{"v":7.567182295171801,"d":"7.6"}]
["1990-2009",{"v":8.180047102958332,"d":"8.2"},{"v":8.145791509640375,"d":"8.1"},{"v":8.135341126614323,"d":"8.1"},{"v":8.48781804751288,"d":"8.5"},{"v":8.398570996145397,"d":"8.4"},{"v":8.281620063582906,"d":"8.3"},{"v":8.725732408549685,"d":"8.7"},{"v":8.084703538879772,"d":"8.1"},{"v":8.06093714756993,"d":"8.1"},{"v":8.160821776489621,"d":"8.2"},{"v":7.985307646634727,"d":"8.0"},{"v":7.76677439338347,"d":"7.8"},{"v":7.549013979938814,"d":"7.5"},{"v":7.7859819326988,"d":"7.8"},{"v":7.341288418883791,"d":"7.3"}]
["1990-2010",{"v":8.180485778042836,"d":"8.2"},{"v":8.146288892882165,"d":"8.1"},{"v":8.134865277231885,"d":"8.1"},{"v":8.48366803592597,"d":"8.5"},{"v":8.39710576609803,"d":"8.4"},{"v":8.279669478458372,"d":"8.3"},{"v":8.724192389091812,"d":"8.7"},{"v":8.081888348600415,"d":"8.1"},{"v":8.058754992798734,"d":"8.1"},{"v":8.158996284784928,"d":"8.2"},{"v":7.986571398583237,"d":"8.0"},{"v":7.767246145464723,"d":"7.8"},{"v":7.554317406742519,"d":"7.6"},{"v":7.783412518449619,"d":"7.8"},{"v":7.304311165917022,"d":"7.3"},{"v":8.369059302263892,"d":"8.4"}]
["1990-2011",{"v":8.180761071128254,"d":"8.2"},{"v":8.146564185967582,"d":"8.1"},{"v":8.135237289051807,"d":"8.1"},{"v":8.484068384545315,"d":"8.5"},{"v":8.397272240208334,"d":"8.4"},{"v":8.279806997404878,"d":"8.3"},{"v":8.724484617470864,"d":"8.7"},{"v":8.078802260625492,"d":"8.1"},{"v":8.055519532815739,"d":"8.1"},{"v":8.15555834312188,"d":"8.2"},{"v":7.9840780799482,"d":"8.0"},{"v":7.764397475601659,"d":"7.8"},{"v":7.550943022603837,"d":"7.6"},{"v":7.7785257568240285,"d":"7.8"},{"v":7.301108523198617,"d":"7.3"},{"v":8.367475634365949,"d":"8.4"},{"v":6.5835893420478415,"d":"6.6"}]
["1990-2012",{"v":8.187662079175139,"d":"8.2"},{"v":8.153386582325302,"d":"8.2"},{"v":8.137314825085827,"d":"8.1"},{"v":8.463549248831526,"d":"8.5"},{"v":8.369399150308709,"d":"8.4"},{"v":8.244635588125517,"d":"8.2"},{"v":8.682088856247278,"d":"8.7"},{"v":8.034443678500963,"d":"8.0"},{"v":8.00562187983309,"d":"8.0"},{"v":8.097769870049383,"d":"8.1"},{"v":7.9194361675152765,"d":"7.9"},{"v":7.699554557792086,"d":"7.7"},{"v":7.488264504824284,"d":"7.5"},{"v":7.716016889815771,"d":"7.7"},{"v":7.251096823432784,"d":"7.3"},{"v":8.320576156186943,"d":"8.3"},{"v":6.5512479827073875,"d":"6.6"},{"v":7.276816745033275,"d":"7.3"}]
["1990-2013",{"v":8.046242508814942,"d":"8.0"},{"v":7.988267308963418,"d":"8.0"},{"v":7.777801310780271,"d":"7.8"},{"v":8.026473566489967,"d":"8.0"},{"v":7.927294967425488,"d":"7.9"},{"v":7.775237274215622,"d":"7.8"},{"v":8.252467117650445,"d":"8.3"},{"v":7.545879030327998,"d":"7.5"},{"v":7.549814014843625,"d":"7.5"},{"v":7.689129548991063,"d":"7.7"},{"v":7.605657267558147,"d":"7.6"},{"v":7.406483829653479,"d":"7.4"},{"v":7.1865994354176905,"d":"7.2"},{"v":7.378229234006114,"d":"7.4"},{"v":7.090716513088386,"d":"7.1"},{"v":7.928506251908195,"d":"7.9"},{"v":6.187449668327704,"d":"6.2"},{"v":7.003909257471121,"d":"7.0"},{"v":7.0004572003654895,"d":"7.0"}]
["1990-2014",{"v":8.007906535564146,"d":"8.0"},{"v":7.949931335712622,"d":"7.9"},{"v":7.7983625500968,"d":"7.8"},{"v":8.03058361542614,"d":"8.0"},{"v":7.921366100094851,"d":"7.9"},{"v":7.789576132471041,"d":"7.8"},{"v":8.278261940904448,"d":"8.3"},{"v":7.576121894932947,"d":"7.6"},{"v":7.569299952014789,"d":"7.6"},{"v":7.710686400137,"d":"7.7"},{"v":7.622664238903371,"d":"7.6"},{"v":7.426376262704059,"d":"7.4"},{"v":7.205774380210181,"d":"7.2"},{"v":7.399028061838798,"d":"7.4"},{"v":7.118324948793672,"d":"7.1"},{"v":7.959449505632445,"d":"8.0"},{"v":6.211033145857326,"d":"6.2"},{"v":7.046399213122902,"d":"7.0"},{"v":7.0351910703903116,"d":"7.0"},{"v":5.883082170673782,"d":"5.9"}]
["1990-2015",{"v":8.134195538508012,"d":"8.1"},{"v":8.076220204291829,"d":"8.1"},{"v":7.9396716133466585,"d":"7.9"},{"v":8.176364422493023,"d":"8.2"},{"v":8.046560897322587,"d":"8.0"},{"v":7.911944591155849,"d":"7.9"},{"v":8.418723173288978,"d":"8.4"},{"v":7.690620405341106,"d":"7.7"},{"v":7.683042011726649,"d":"7.7"},{"v":7.849481405198981,"d":"7.8"},{"v":7.724595981733114,"d":"7.7"},{"v":7.535918493705419,"d":"7.5"},{"v":7.299393218415435,"d":"7.3"},{"v":7.510078948607118,"d":"7.5"},{"v":7.210845314339884,"d":"7.2"},{"v":8.068750193362565,"d":"8.1"},{"v":6.281944042679145,"d":"6.3"},{"v":7.117458832984503,"d":"7.1"},{"v":7.12197595246421,"d":"7.1"},{"v":5.923176754539635,"d":"5.9"},{"v":6.101517145539943,"d":"6.1"}]
["1990-2016",{"v":8.060449787785258,"d":"8.1"},{"v":8.002474453569075,"d":"8.0"},{"v":7.843106934693921,"d":"7.8"},{"v":8.067813663820708,"d":"8.1"},{"v":7.958271042484511,"d":"8.0"},{"v":7.818573924093492,"d":"7.8"},{"v":8.31657998576662,"d":"8.3"},{"v":7.610844679923262,"d":"7.6"},{"v":7.606268905712861,"d":"7.6"},{"v":7.765078886797249,"d":"7.8"},{"v":7.708354199197076,"d":"7.7"},{"v":7.503006869515877,"d":"7.5"},{"v":7.266413964442026,"d":"7.3"},{"v":7.471506513442374,"d":"7.5"},{"v":7.180210885366898,"d":"7.2"},{"v":8.01353573835949,"d":"8.0"},{"v":6.487329873986416,"d":"6.5"},{"v":7.027330477380321,"d":"7.0"},{"v":7.066100947536707,"d":"7.1"},{"v":5.939297637338415,"d":"5.9"},{"v":6.111750932083385,"d":"6.1"},{"v":6.315866349380111,"d":"6.3"}]
["Waste Management"]
["1990-2008",{"v":5.777833844220619,"d":"5.8"},{"v":5.777833844220619,"d":"5.8"},{"v":5.140564644582216,"d":"5.1"},{"v":4.31551405167151,"d":"4.3"},{"v":3.955834180215241,"d":"4.0"},{"v":3.733510262974629,"d":"3.7"},{"v":3.127163494934596,"d":"3.1"},{"v":2.928920243039537,"d":"2.9"},{"v":2.5772198225658705,"d":"2.6"},{"v":2.498858762947675,"d":"2.5"},{"v":2.4903056476085057,"d":"2.5"},{"v":2.62234895514991,"d":"2.6"},{"v":2.640524553793253,"d":"2.6"},{"v":2.7534552624592665,"d":"2.8"}]
["1990-2009",{"v":6.475987387712436,"d":"6.5"},{"v":6.475987387712436,"d":"6.5"},{"v":5.055194689989844,"d":"5.1"},{"v":4.077434250318138,"d":"4.1"},{"v":3.7015677374424443,"d":"3.7"},{"v":3.45044746335069,"d":"3.5"},{"v":2.8797897811157793,"d":"2.9"},{"v":2.6765235173577464,"d":"2.7"},{"v":2.3386182793108516,"d":"2.3"},{"v":2.2359902754831653,"d":"2.2"},{"v":2.1772565151815026,"d":"2.2"},{"v":2.238865827486938,"d":"2.2"},{"v":2.202501191819564,"d":"2.2"},{"v":2.2355421648399387,"d":"2.2"},{"v":2.073573109280854,"d":"2.1"}]
["1990-2010",{"v":6.571715394342479,"d":"6.6"},{"v":6.571715394342479,"d":"6.6"},{"v":5.660849784798108,"d":"5.7"},{"v":4.6950854805108015,"d":"4.7"},{"v":4.259113697513956,"d":"4.3"},{"v":3.9781422388236227,"d":"4.0"},{"v":3.4658388208164324,"d":"3.5"},{"v":3.153028806270039,"d":"3.2"},{"v":2.756299493516256,"d":"2.8"},{"v":2.5518846080070503,"d":"2.6"},{"v":2.4760501431620074,"d":"2.5"},{"v":2.415669744187295,"d":"2.4"},{"v":2.351868715512343,"d":"2.4"},{"v":2.2851872885009805,"d":"2.3"},{"v":2.222553092037028,"d":"2.2"},{"v":2.1543521156764602,"d":"2.2"}]
["1990-2011",{"v":6.712290752160702,"d":"6.7"},{"v":6.712290752160702,"d":"6.7"},{"v":5.794315214842169,"d":"5.8"},{"v":4.831300755275304,"d":"4.8"},{"v":4.399076768992399,"d":"4.4"},{"v":4.122973319359287,"d":"4.1"},{"v":3.5987032780544688,"d":"3.6"},{"v":3.2835218376472377,"d":"3.3"},{"v":2.879998207256802,"d":"2.9"},{"v":2.686352064711332,"d":"2.7"},{"v":2.609655940777417,"d":"2.6"},{"v":2.5487530957494546,"d":"2.5"},{"v":2.464836530383858,"d":"2.5"},{"v":2.3986986881736345,"d":"2.4"},{"v":2.3204149217925476,"d":"2.3"},{"v":2.237292107664813,"d":"2.2"},{"v":2.174141903747811,"d":"2.2"}]
["1990-2012",{"v":6.6958623626893266,"d":"6.7"},{"v":6.6958623626893266,"d":"6.7"},{"v":6.745487639458251,"d":"6.7"},{"v":6.2454271577547225,"d":"6.2"},{"v":5.657916320807106,"d":"5.7"},{"v":5.234974864587711,"d":"5.2"},{"v":5.059884856755869,"d":"5.1"},{"v":5.072770847892992,"d":"5.1"},{"v":4.59954594170034,"d":"4.6"},{"v":4.041825029732036,"d":"4.0"},{"v":3.8928256568394746,"d":"3.9"},{"v":3.8335926255251875,"d":"3.8"},{"v":3.63157974358102,"d":"3.6"},{"v":3.58772159440625,"d":"3.6"},{"v":3.382790865683847,"d":"3.4"},{"v":2.964817230774625,"d":"3.0"},{"v":2.9226058223102864,"d":"2.9"},{"v":2.768770799147013,"d":"2.8"}]
["1990-2013",{"v":9.862435843172271,"d":"9.9"},{"v":9.862435843172271,"d":"9.9"},{"v":10.082106745783927,"d":"10.1"},{"v":9.796660121222395,"d":"9.8"},{"v":9.388830975733782,"d":"9.4"},{"v":9.060293450242108,"d":"9.1"},{"v":8.76779422087532,"d":"8.8"},{"v":8.588488981435617,"d":"8.6"},{"v":8.040080539773093,"d":"8.0"},{"v":7.41601686294463,"d":"7.4"},{"v":6.966558865236732,"d":"7.0"},{"v":6.521919273107941,"d":"6.5"},{"v":6.021573931950325,"d":"6.0"},{"v":5.362207855498416,"d":"5.4"},{"v":4.5977711032641855,"d":"4.6"},{"v":3.933355376067647,"d":"3.9"},{"v":3.5994095115306433,"d":"3.6"},{"v":3.206716307584273,"d":"3.2"},{"v":2.7034870117982437,"d":"2.7"}]
["1990-2014",{"v":9.835102194297077,"d":"9.8"},{"v":9.835102194297077,"d":"9.8"},{"v":10.06981270837126,"d":"10.1"},{"v":9.787340077235783,"d":"9.8"},{"v":9.385533943161077,"d":"9.4"},{"v":9.060419241609832,"d":"9.1"},{"v":8.728667104080117,"d":"8.7"},{"v":8.54380085183586,"d":"8.5"},{"v":7.98970918816503,"d":"8.0"},{"v":7.355053116028671,"d":"7.4"},{"v":6.89721138710634,"d":"6.9"},{"v":6.456649830002579,"d":"6.5"},{"v":5.946041460484,"d":"5.9"},{"v":5.26992188318693,"d":"5.3"},{"v":4.505265745076955,"d":"4.5"},{"v":3.7649480106085287,"d":"3.8"},{"v":3.4517583388439226,"d":"3.5"},{"v":3.0576754142242537,"d":"3.1"},{"v":2.564245576709669,"d":"2.6"},{"v":2.2369227943521537,"d":"2.2"}]
["1990-2015",{"v":5.625670203539032,"d":"5.6"},{"v":5.625670203539033,"d":"5.6"},{"v":6.164555031403974,"d":"6.2"},{"v":6.23858966033764,"d":"6.2"},{"v":6.13005469471266,"d":"6.1"},{"v":6.175956388083091,"d":"6.2"},{"v":5.786117675188962,"d":"5.8"},{"v":5.443316020167431,"d":"5.4"},{"v":4.965442004220681,"d":"5.0"},{"v":4.356989809488989,"d":"4.4"},{"v":3.9671201896809505,"d":"4.0"},{"v":3.5641465908648944,"d":"3.6"},{"v":3.194737617413302,"d":"3.2"},{"v":3.048187865839797,"d":"3.0"},{"v":2.729456342167698,"d":"2.7"},{"v":2.5080180409685844,"d":"2.5"},{"v":2.4361742219402,"d":"2.4"},{"v":2.0448407343649353,"d":"2.0"},{"v":1.4209961697472677,"d":"1.4"},{"v":1.4731731398251706,"d":"1.5"},{"v":1.4129108715500922,"d":"1.4"}]
["1990-2016",{"v":6.028898948641075,"d":"6.0"},{"v":6.028898948641075,"d":"6.0"},{"v":6.23229304933958,"d":"6.2"},{"v":6.0742400139856745,"d":"6.1"},{"v":5.841250713918729,"d":"5.8"},{"v":5.717962776288399,"d":"5.7"},{"v":5.383855734760847,"d":"5.4"},{"v":5.195605485194891,"d":"5.2"},{"v":5.064769333191435,"d":"5.1"},{"v":4.442156901066763,"d":"4.4"},{"v":4.040151611814831,"d":"4.0"},{"v":3.625365016563159,"d":"3.6"},{"v":3.2489726335641205,"d":"3.2"},{"v":3.098372893026002,"d":"3.1"},{"v":2.775842096885446,"d":"2.8"},{"v":2.5376111888639037,"d":"2.5"},{"v":2.4027163469659856,"d":"2.4"},{"v":2.055262298786766,"d":"2.1"},{"v":1.4530815469608493,"d":"1.5"},{"v":1.4693437459795862,"d":"1.5"},{"v":1.7258379131087094,"d":"1.7"},{"v":1.6417933315883455,"d":"1.6"}]
["Transport (including International Aviation and Shipping)"]
["1990-2008",{"v":13.302906419656587,"d":"13.3"},{"v":13.302906419656587,"d":"13.3"},{"v":13.192404078439033,"d":"13.2"},{"v":14.100670101917588,"d":"14.1"},{"v":13.756730404532817,"d":"13.8"},{"v":13.462353396557688,"d":"13.5"},{"v":13.410008205013824,"d":"13.4"},{"v":13.339927354473001,"d":"13.3"},{"v":13.620630868757754,"d":"13.6"},{"v":13.940466783983352,"d":"13.9"},{"v":14.22172563462433,"d":"14.2"},{"v":14.75848959975896,"d":"14.8"},{"v":14.840595020471472,"d":"14.8"},{"v":14.448334300209464,"d":"14.4"}]
["1990-2009",{"v":13.091505406817804,"d":"13.1"},{"v":13.091505406817804,"d":"13.1"},{"v":13.067563792437408,"d":"13.1"},{"v":13.930091738349413,"d":"13.9"},{"v":13.593881524726177,"d":"13.6"},{"v":13.267927350447751,"d":"13.3"},{"v":13.222024290339093,"d":"13.2"},{"v":13.149958826921983,"d":"13.1"},{"v":13.338296290226292,"d":"13.3"},{"v":13.682086956554649,"d":"13.7"},{"v":13.975441510428734,"d":"14.0"},{"v":14.49796995527128,"d":"14.5"},{"v":14.602869446132404,"d":"14.6"},{"v":14.260457950209622,"d":"14.3"},{"v":13.57656013251324,"d":"13.6"}]
["1990-2010",{"v":13.031227139327736,"d":"13.0"},{"v":13.031227139327735,"d":"13.0"},{"v":13.000809117298008,"d":"13.0"},{"v":13.873530373869245,"d":"13.9"},{"v":13.520529139210455,"d":"13.5"},{"v":13.197838617743711,"d":"13.2"},{"v":13.15617064770387,"d":"13.2"},{"v":13.088376075328066,"d":"13.1"},{"v":13.289829092664458,"d":"13.3"},{"v":13.643746032958546,"d":"13.6"},{"v":13.944932196443887,"d":"13.9"},{"v":14.495309640034524,"d":"14.5"},{"v":14.648395318702802,"d":"14.6"},{"v":14.29704212571047,"d":"14.3"},{"v":13.601318337475155,"d":"13.6"},{"v":13.203962576401372,"d":"13.2"}]
["1990-2011",{"v":12.946886219190022,"d":"12.9"},{"v":12.946886219190022,"d":"12.9"},{"v":12.930689894149884,"d":"12.9"},{"v":13.781512419883557,"d":"13.8"},{"v":13.436564251051077,"d":"13.4"},{"v":13.126531290960335,"d":"13.1"},{"v":13.094052235055981,"d":"13.1"},{"v":13.035581265116214,"d":"13.0"},{"v":13.252858212450022,"d":"13.3"},{"v":13.614820377372885,"d":"13.6"},{"v":13.935105918433665,"d":"13.9"},{"v":14.536638568997903,"d":"14.5"},{"v":14.680777657788612,"d":"14.7"},{"v":14.256843333163177,"d":"14.3"},{"v":13.636115717067728,"d":"13.6"},{"v":13.097709795940125,"d":"13.1"},{"v":12.96255869898938,"d":"13.0"}]
["1990-2012",{"v":13.058200624349292,"d":"13.1"},{"v":13.058200624349286,"d":"13.1"},{"v":13.08722309340336,"d":"13.1"},{"v":13.988085485013329,"d":"14.0"},{"v":13.582013284844667,"d":"13.6"},{"v":13.171978695853564,"d":"13.2"},{"v":13.143962458392128,"d":"13.1"},{"v":13.051640942975958,"d":"13.1"},{"v":13.265940395521254,"d":"13.3"},{"v":13.63191559604052,"d":"13.6"},{"v":13.967188683555676,"d":"14.0"},{"v":14.549118495881014,"d":"14.5"},{"v":14.83543527149724,"d":"14.8"},{"v":14.360999434451768,"d":"14.4"},{"v":13.75094598305365,"d":"13.8"},{"v":13.19014920131352,"d":"13.2"},{"v":13.078673007421628,"d":"13.1"},{"v":12.90416748119759,"d":"12.9"}]
["1990-2013",{"v":13.203435302559214,"d":"13.2"},{"v":13.20343530255921,"d":"13.2"},{"v":13.204766230618329,"d":"13.2"},{"v":14.129850254736203,"d":"14.1"},{"v":13.707550984589352,"d":"13.7"},{"v":13.293541356871781,"d":"13.3"},{"v":13.26895058523106,"d":"13.3"},{"v":13.189820203558282,"d":"13.2"},{"v":13.405759055388993,"d":"13.4"},{"v":13.769649658046497,"d":"13.8"},{"v":14.105965340154565,"d":"14.1"},{"v":14.675958800671749,"d":"14.7"},{"v":14.834554305238104,"d":"14.8"},{"v":14.4947981756787,"d":"14.5"},{"v":13.858867408329997,"d":"13.9"},{"v":13.310710019097867,"d":"13.3"},{"v":13.187152083963989,"d":"13.2"},{"v":13.015552819072182,"d":"13.0"},{"v":12.931708648255345,"d":"12.9"}]
["1990-2014",{"v":13.293706465629178,"d":"13.3"},{"v":13.29370646562918,"d":"13.3"},{"v":13.311336837286628,"d":"13.3"},{"v":14.273515904895532,"d":"14.3"},{"v":13.8528840759801,"d":"13.9"},{"v":13.42392980255941,"d":"13.4"},{"v":13.393348748048819,"d":"13.4"},{"v":13.325838156050432,"d":"13.3"},{"v":13.527537740626547,"d":"13.5"},{"v":13.880491754504284,"d":"13.9"},{"v":14.21825667847727,"d":"14.2"},{"v":14.772189368545483,"d":"14.8"},{"v":14.922013804824442,"d":"14.9"},{"v":14.573452788460862,"d":"14.6"},{"v":13.928244904158802,"d":"13.9"},{"v":13.377678639626891,"d":"13.4"},{"v":13.246360144983424,"d":"13.2"},{"v":13.059936004334663,"d":"13.1"},{"v":12.925722152146692,"d":"12.9"},{"v":12.924191916242965,"d":"12.9"}]
["1990-2015",{"v":13.295673164798883,"d":"13.3"},{"v":13.295673164798883,"d":"13.3"},{"v":13.301909436335869,"d":"13.3"},{"v":14.263104126592332,"d":"14.3"},{"v":13.841985220907125,"d":"13.8"},{"v":13.413381154377896,"d":"13.4"},{"v":13.380724986749797,"d":"13.4"},{"v":13.312043753010624,"d":"13.3"},{"v":13.514572986511702,"d":"13.5"},{"v":13.869378757681778,"d":"13.9"},{"v":14.207771253365433,"d":"14.2"},{"v":14.762479629584362,"d":"14.8"},{"v":14.912223684420896,"d":"14.9"},{"v":14.56507368503921,"d":"14.6"},{"v":13.921224704953207,"d":"13.9"},{"v":13.370771001805966,"d":"13.4"},{"v":13.238413364805279,"d":"13.2"},{"v":13.056476693212684,"d":"13.1"},{"v":12.965515399122179,"d":"13.0"},{"v":13.090775875305694,"d":"13.1"},{"v":13.144653734174561,"d":"13.1"}]
["1990-2016",{"v":14.761265833029025,"d":"14.8"},{"v":14.761265833029023,"d":"14.8"},{"v":15.711687809387032,"d":"15.7"},{"v":16.35111246236676,"d":"16.4"},{"v":16.277443470276587,"d":"16.3"},{"v":15.57499850538174,"d":"15.6"},{"v":15.419718110123862,"d":"15.4"},{"v":15.777368591784942,"d":"15.8"},{"v":15.55685328864839,"d":"15.6"},{"v":15.659289317951478,"d":"15.7"},{"v":15.837510740841779,"d":"15.8"},{"v":15.823606548219047,"d":"15.8"},{"v":16.137636762530356,"d":"16.1"},{"v":15.539163989580281,"d":"15.5"},{"v":14.857172684788509,"d":"14.9"},{"v":14.337474103561567,"d":"14.3"},{"v":13.923373916674361,"d":"13.9"},{"v":13.671272676411522,"d":"13.7"},{"v":13.558424127513515,"d":"13.6"},{"v":13.765500308614358,"d":"13.8"},{"v":14.07769135365837,"d":"14.1"},{"v":14.39727255773166,"d":"14.4"}]
["Development"]
["1990-2008",{"v":1.776595236241248,"d":"1.8"},{"v":1.776595236241248,"d":"1.8"},{"v":1.7275679210513113,"d":"1.7"},{"v":1.7308040838739096,"d":"1.7"},{"v":1.7206523517304486,"d":"1.7"},{"v":1.7162985765966894,"d":"1.7"},{"v":1.715050610920676,"d":"1.7"},{"v":1.703030532577703,"d":"1.7"},{"v":1.7031515957146337,"d":"1.7"},{"v":1.698188055228212,"d":"1.7"},{"v":1.6894604089568512,"d":"1.7"},{"v":1.6788214257970246,"d":"1.7"},{"v":1.6816944434574206,"d":"1.7"},{"v":1.6769499253637972,"d":"1.7"}]
["1990-2009",{"v":1.7866390076860954,"d":"1.8"},{"v":1.7866390076860954,"d":"1.8"},{"v":1.7485630478839054,"d":"1.7"},{"v":1.7556920898626882,"d":"1.8"},{"v":1.750389835611908,"d":"1.8"},{"v":1.7304182761798985,"d":"1.7"},{"v":1.7151517263121145,"d":"1.7"},{"v":1.68744045748832,"d":"1.7"},{"v":1.6740913958155463,"d":"1.7"},{"v":1.6550451206855772,"d":"1.7"},{"v":1.6355654567399711,"d":"1.6"},{"v":1.605442312236828,"d":"1.6"},{"v":1.5872133404435753,"d":"1.6"},{"v":1.5654715379066029,"d":"1.6"},{"v":1.5480786435047191,"d":"1.5"}]
["1990-2010",{"v":1.7800708290294567,"d":"1.8"},{"v":1.7800708290294567,"d":"1.8"},{"v":1.7613033102527047,"d":"1.8"},{"v":1.7520816566617234,"d":"1.8"},{"v":1.784269436841258,"d":"1.8"},{"v":1.7645722664795007,"d":"1.8"},{"v":1.7460106757364788,"d":"1.7"},{"v":1.7283555231743248,"d":"1.7"},{"v":1.7115614305052995,"d":"1.7"},{"v":1.6955863954542374,"d":"1.7"},{"v":1.6803904720565965,"d":"1.7"},{"v":1.6659356625883075,"d":"1.7"},{"v":1.652185822496523,"d":"1.7"},{"v":1.6391065700190313,"d":"1.6"},{"v":1.6266652002119728,"d":"1.6"},{"v":1.6135872488565965,"d":"1.6"}]
["1990-2011",{"v":1.7486462044136775,"d":"1.7"},{"v":1.7486462044136775,"d":"1.7"},{"v":1.73393657321843,"d":"1.7"},{"v":1.7269684792169624,"d":"1.7"},{"v":1.746479207015613,"d":"1.7"},{"v":1.7272955377910046,"d":"1.7"},{"v":1.7092290104608403,"d":"1.7"},{"v":1.6924035766173255,"d":"1.7"},{"v":1.6766086977304653,"d":"1.7"},{"v":1.6617128706615247,"d":"1.7"},{"v":1.6475846588873866,"d":"1.6"},{"v":1.6342279982357621,"d":"1.6"},{"v":1.6212998449728064,"d":"1.6"},{"v":1.6091738455425508,"d":"1.6"},{"v":1.5976356020839417,"d":"1.6"},{"v":1.6294974720475908,"d":"1.6"},{"v":1.6604725124426907,"d":"1.7"}]
["1990-2012",{"v":1.7394868672620696,"d":"1.7"},{"v":1.7394868672620696,"d":"1.7"},{"v":1.7255118685934403,"d":"1.7"},{"v":1.7192710168041223,"d":"1.7"},{"v":1.7349184247701568,"d":"1.7"},{"v":1.716526626804751,"d":"1.7"},{"v":1.6990937500631758,"d":"1.7"},{"v":1.6823388985662968,"d":"1.7"},{"v":1.6664856989508334,"d":"1.7"},{"v":1.6514059925572033,"d":"1.7"},{"v":1.6370711560427864,"d":"1.6"},{"v":1.6234569706446726,"d":"1.6"},{"v":1.6105658784549275,"d":"1.6"},{"v":1.598338468723959,"d":"1.6"},{"v":1.5867781149239175,"d":"1.6"},{"v":1.6187903498863452,"d":"1.6"},{"v":1.6501220423944625,"d":"1.7"},{"v":1.6799725716594653,"d":"1.7"}]
["1990-2013",{"v":1.8287529712970707,"d":"1.8"},{"v":1.8287529712970707,"d":"1.8"},{"v":1.8098100694379242,"d":"1.8"},{"v":1.8027201710104714,"d":"1.8"},{"v":1.8184243282563162,"d":"1.8"},{"v":1.7589061334250218,"d":"1.8"},{"v":1.737600275229051,"d":"1.7"},{"v":1.7175701798798773,"d":"1.7"},{"v":1.6987942651504149,"d":"1.7"},{"v":1.68116878535447,"d":"1.7"},{"v":1.664620629760747,"d":"1.7"},{"v":1.6490828112282874,"d":"1.6"},{"v":1.634499446426977,"d":"1.6"},{"v":1.6208027696783736,"d":"1.6"},{"v":1.6079450869249559,"d":"1.6"},{"v":1.594704834109168,"d":"1.6"},{"v":1.582153159660067,"d":"1.6"},{"v":1.570299882366349,"d":"1.6"},{"v":1.5591041996319719,"d":"1.6"}]
["1990-2014",{"v":1.8438479937028232,"d":"1.8"},{"v":1.8438479937028234,"d":"1.8"},{"v":1.82234027360514,"d":"1.8"},{"v":1.814010393258413,"d":"1.8"},{"v":1.8290344598882886,"d":"1.8"},{"v":1.7723527749375796,"d":"1.8"},{"v":1.7530518349183288,"d":"1.8"},{"v":1.7349119462787852,"d":"1.7"},{"v":1.7179180406117789,"d":"1.7"},{"v":1.7019735316506508,"d":"1.7"},{"v":1.687011564590986,"d":"1.7"},{"v":1.6729709650810298,"d":"1.7"},{"v":1.6598011564460127,"d":"1.7"},{"v":1.6474395996395224,"d":"1.6"},{"v":1.6358432070474647,"d":"1.6"},{"v":1.625459671340891,"d":"1.6"},{"v":1.6156074357322925,"d":"1.6"},{"v":1.6063355716392334,"d":"1.6"},{"v":1.597607935172279,"d":"1.6"},{"v":1.5893804409994456,"d":"1.6"}]
["1990-2015",{"v":1.8924486108635457,"d":"1.9"},{"v":1.8924486108635459,"d":"1.9"},{"v":1.8713514066163548,"d":"1.9"},{"v":1.8636682960838349,"d":"1.9"},{"v":1.8775406745699101,"d":"1.9"},{"v":1.827645750117606,"d":"1.8"},{"v":1.8119836815820611,"d":"1.8"},{"v":1.7973556738533785,"d":"1.8"},{"v":1.7836854024379698,"d":"1.8"},{"v":1.7709004015491627,"d":"1.8"},{"v":1.7589389989643556,"d":"1.8"},{"v":1.755218041301064,"d":"1.8"},{"v":1.7450088523166476,"d":"1.7"},{"v":1.7354559780577625,"d":"1.7"},{"v":1.7856434474870102,"d":"1.8"},{"v":1.779583659677451,"d":"1.8"},{"v":1.7737616286329398,"d":"1.8"},{"v":1.743898768104163,"d":"1.7"},{"v":1.737662399762257,"d":"1.7"},{"v":1.7131371125962305,"d":"1.7"},{"v":1.7075181604193217,"d":"1.7"}]
["1990-2016",{"v":1.8915056233148553,"d":"1.9"},{"v":1.8915056233148553,"d":"1.9"},{"v":1.869772772788841,"d":"1.9"},{"v":1.86167402415193,"d":"1.9"},{"v":1.873226874617659,"d":"1.9"},{"v":1.8532142400521123,"d":"1.9"},{"v":1.840364019895547,"d":"1.8"},{"v":1.8623060074131392,"d":"1.9"},{"v":1.9245637907023256,"d":"1.9"},{"v":2.004664040075341,"d":"2.0"},{"v":1.9800938074623413,"d":"2.0"},{"v":1.8225522338426832,"d":"1.8"},{"v":1.8630901863570872,"d":"1.9"},{"v":1.8626445778056342,"d":"1.9"},{"v":1.8663497654986445,"d":"1.9"},{"v":1.9309166081202986,"d":"1.9"},{"v":1.9147954588732443,"d":"1.9"},{"v":1.893604343964717,"d":"1.9"},{"v":1.9274366665319045,"d":"1.9"},{"v":1.8797522463412857,"d":"1.9"},{"v":1.8723437562961636,"d":"1.9"},{"v":2.02380440492892,"d":"2.0"}]
["Public Sector Buildings"]
["1990-2008",{"v":1.2755101338710124,"d":"1.3"},{"v":1.2755101338710124,"d":"1.3"},{"v":1.1230742911217473,"d":"1.1"},{"v":1.143935976572022,"d":"1.1"},{"v":1.1462136015843045,"d":"1.1"},{"v":1.0531278669934463,"d":"1.1"},{"v":1.1140272450681785,"d":"1.1"},{"v":0.9364160434281635,"d":"0.9"},{"v":0.9073663276780229,"d":"0.9"},{"v":1.026212345568799,"d":"1.0"},{"v":1.0534255270400639,"d":"1.1"},{"v":1.00343640082345,"d":"1.0"},{"v":0.9176402463280156,"d":"0.9"},{"v":0.986316349775703,"d":"1.0"}]
["1990-2009",{"v":1.3301616042898612,"d":"1.3"},{"v":1.3301616042898612,"d":"1.3"},{"v":1.1704879788607723,"d":"1.2"},{"v":1.149937192448463,"d":"1.1"},{"v":1.1525725846759074,"d":"1.2"},{"v":1.0586290262449352,"d":"1.1"},{"v":1.1174766984462694,"d":"1.1"},{"v":0.9396333726883127,"d":"0.9"},{"v":0.9089844211209644,"d":"0.9"},{"v":1.030931635053044,"d":"1.0"},{"v":1.0709909577906618,"d":"1.1"},{"v":0.9651780232361699,"d":"1.0"},{"v":0.8898617776810979,"d":"0.9"},{"v":0.8984989261850851,"d":"0.9"},{"v":0.789744897780588,"d":"0.8"}]
["1990-2010",{"v":1.2259937220260662,"d":"1.2"},{"v":1.2259937220260662,"d":"1.2"},{"v":1.0741471159519709,"d":"1.1"},{"v":1.123886296605563,"d":"1.1"},{"v":1.1272145330035233,"d":"1.1"},{"v":1.036747649154179,"d":"1.0"},{"v":1.104046779566471,"d":"1.1"},{"v":0.9262142440604263,"d":"0.9"},{"v":0.9140258082028729,"d":"0.9"},{"v":1.033471321172014,"d":"1.0"},{"v":1.060683411955843,"d":"1.1"},{"v":0.9608990959668167,"d":"1.0"},{"v":0.9110196951387706,"d":"0.9"},{"v":0.9458737088317697,"d":"0.9"},{"v":0.8487104454371215,"d":"0.8"},{"v":0.8747164621204527,"d":"0.9"}]
["1990-2011",{"v":1.2255687844766356,"d":"1.2"},{"v":1.2255687844766356,"d":"1.2"},{"v":1.0722836149872124,"d":"1.1"},{"v":1.1225832565399034,"d":"1.1"},{"v":1.1192956285772317,"d":"1.1"},{"v":1.0310329907305475,"d":"1.0"},{"v":1.0981335972983206,"d":"1.1"},{"v":0.9228838845017364,"d":"0.9"},{"v":0.9111044349428935,"d":"0.9"},{"v":1.0309025583155373,"d":"1.0"},{"v":1.0697598743002046,"d":"1.1"},{"v":0.9695926266166883,"d":"1.0"},{"v":0.9167532548081607,"d":"0.9"},{"v":0.9503280203370232,"d":"1.0"},{"v":0.848374246392127,"d":"0.8"},{"v":0.8739232307920879,"d":"0.9"},{"v":0.7469392436371914,"d":"0.7"}]
["1990-2012",{"v":1.6629096891615383,"d":"1.7"},{"v":1.6629096891615378,"d":"1.7"},{"v":1.7614887063314786,"d":"1.8"},{"v":1.7263841695485505,"d":"1.7"},{"v":1.6958655142527403,"d":"1.7"},{"v":1.58363504920897,"d":"1.6"},{"v":1.6613449639349616,"d":"1.7"},{"v":1.4186957828135218,"d":"1.4"},{"v":1.4217253250187682,"d":"1.4"},{"v":1.5473904300544608,"d":"1.5"},{"v":1.5174489944701397,"d":"1.5"},{"v":1.373580452379031,"d":"1.4"},{"v":1.2682686097256535,"d":"1.3"},{"v":1.359885955468619,"d":"1.4"},{"v":1.3290671420841083,"d":"1.3"},{"v":1.4256822004721468,"d":"1.4"},{"v":1.3104063118273441,"d":"1.3"},{"v":1.3669625350844614,"d":"1.4"}]
["1990-2013",{"v":1.6840783774850872,"d":"1.7"},{"v":1.684078377485087,"d":"1.7"},{"v":1.8027027608462538,"d":"1.8"},{"v":1.768131548479627,"d":"1.8"},{"v":1.7507162476531821,"d":"1.8"},{"v":1.63953851853733,"d":"1.6"},{"v":1.6846041116833785,"d":"1.7"},{"v":1.43529800666862,"d":"1.4"},{"v":1.4285925855499138,"d":"1.4"},{"v":1.5535157149679777,"d":"1.6"},{"v":1.5281106009518928,"d":"1.5"},{"v":1.3794200187441956,"d":"1.4"},{"v":1.280361475554977,"d":"1.3"},{"v":1.4767026306898021,"d":"1.5"},{"v":1.251591419558475,"d":"1.3"},{"v":1.3151604676911828,"d":"1.3"},{"v":1.249430612700459,"d":"1.2"},{"v":1.238781219041026,"d":"1.2"},{"v":1.2429418071398657,"d":"1.2"}]
["1990-2014",{"v":1.6828055978243401,"d":"1.7"},{"v":1.68280559782434,"d":"1.7"},{"v":1.8022989969915486,"d":"1.8"},{"v":1.7677664999539473,"d":"1.8"},{"v":1.7502811302994141,"d":"1.8"},{"v":1.6392140863053148,"d":"1.6"},{"v":1.6843777239512312,"d":"1.7"},{"v":1.435884771481243,"d":"1.4"},{"v":1.4285401443352181,"d":"1.4"},{"v":1.5521060469180505,"d":"1.6"},{"v":1.4983055576955586,"d":"1.5"},{"v":1.3642056856458382,"d":"1.4"},{"v":1.275148238395534,"d":"1.3"},{"v":1.4651363250626999,"d":"1.5"},{"v":1.2407895579336718,"d":"1.2"},{"v":1.3086307027224384,"d":"1.3"},{"v":1.2489033493714095,"d":"1.2"},{"v":1.2395029193341092,"d":"1.2"},{"v":1.2510834388575605,"d":"1.3"},{"v":1.073009954865017,"d":"1.1"}]
["1990-2015",{"v":1.6826063117441779,"d":"1.7"},{"v":1.6826063117441779,"d":"1.7"},{"v":1.8021342140262178,"d":"1.8"},{"v":1.7719803539098409,"d":"1.8"},{"v":1.7534703972075578,"d":"1.8"},{"v":1.6431385682492272,"d":"1.6"},{"v":1.6873839516897395,"d":"1.7"},{"v":1.437105120464361,"d":"1.4"},{"v":1.4288809601553043,"d":"1.4"},{"v":1.5555901091560456,"d":"1.6"},{"v":1.5268818358673346,"d":"1.5"},{"v":1.3779758156684372,"d":"1.4"},{"v":1.2793775928922508,"d":"1.3"},{"v":1.4796360001553888,"d":"1.5"},{"v":1.2530963426431998,"d":"1.3"},{"v":1.3178540902746587,"d":"1.3"},{"v":1.2533193089140877,"d":"1.3"},{"v":1.2485176060355143,"d":"1.2"},{"v":1.2587200466478141,"d":"1.3"},{"v":1.0760128630830967,"d":"1.1"},{"v":1.0556473862265994,"d":"1.1"}]
["1990-2016",{"v":1.6886004539593495,"d":"1.7"},{"v":1.6886004539593495,"d":"1.7"},{"v":1.8072493937553737,"d":"1.8"},{"v":1.7712434298625306,"d":"1.8"},{"v":1.7493934613345623,"d":"1.7"},{"v":1.6457393553250055,"d":"1.6"},{"v":1.6840599838123222,"d":"1.7"},{"v":1.4330732899260419,"d":"1.4"},{"v":1.4280549190372593,"d":"1.4"},{"v":1.553388815409717,"d":"1.6"},{"v":1.527420033696906,"d":"1.5"},{"v":1.3793942760857438,"d":"1.4"},{"v":1.280124136593889,"d":"1.3"},{"v":1.3324384956369468,"d":"1.3"},{"v":1.1949883313333463,"d":"1.2"},{"v":1.2770194938000554,"d":"1.3"},{"v":1.0569459023805272,"d":"1.1"},{"v":1.1937630412233258,"d":"1.2"},{"v":1.1987597557451632,"d":"1.2"},{"v":1.0229815584103208,"d":"1.0"},{"v":1.0605880145277449,"d":"1.1"},{"v":1.080873847672729,"d":"1.1"}]
["Forestry"]
["1990-2008",{"v":-8.292910850751227,"d":"-8.3"},{"v":-8.292910850751227,"d":"-8.3"},{"v":-9.471092430824648,"d":"-9.5"},{"v":-9.482744484624751,"d":"-9.5"},{"v":-9.63892532851047,"d":"-9.6"},{"v":-9.61686773948449,"d":"-9.6"},{"v":-9.656500593810593,"d":"-9.7"},{"v":-9.781958951314287,"d":"-9.8"},{"v":-10.004134440426839,"d":"-10.0"},{"v":-10.258161414837435,"d":"-10.3"},{"v":-10.25219415567214,"d":"-10.3"},{"v":-10.154704886481202,"d":"-10.2"},{"v":-10.083552619009795,"d":"-10.1"},{"v":-10.064362162993232,"d":"-10.1"}]
["1990-2009",{"v":-8.271891829885599,"d":"-8.3"},{"v":-8.271891829885599,"d":"-8.3"},{"v":-9.378200930644297,"d":"-9.4"},{"v":-9.441043052876744,"d":"-9.4"},{"v":-9.620797530430796,"d":"-9.6"},{"v":-9.589266533095875,"d":"-9.6"},{"v":-9.617652450498358,"d":"-9.6"},{"v":-9.748011755519626,"d":"-9.7"},{"v":-9.968186361354878,"d":"-10.0"},{"v":-10.20450389102974,"d":"-10.2"},{"v":-10.200543251597647,"d":"-10.2"},{"v":-10.079165142472316,"d":"-10.1"},{"v":-10.009268419027373,"d":"-10.0"},{"v":-10.010370438017,"d":"-10.0"},{"v":-9.974804350540886,"d":"-10.0"}]
["1990-2010",{"v":-8.304582604513094,"d":"-8.3"},{"v":-8.304582604513094,"d":"-8.3"},{"v":-9.480939171499788,"d":"-9.5"},{"v":-9.466849288900985,"d":"-9.5"},{"v":-9.627809490040633,"d":"-9.6"},{"v":-9.572736127171833,"d":"-9.6"},{"v":-9.623683644429015,"d":"-9.6"},{"v":-9.836991122974325,"d":"-9.8"},{"v":-10.144054562317026,"d":"-10.1"},{"v":-10.35483764136368,"d":"-10.4"},{"v":-10.178938140166018,"d":"-10.2"},{"v":-10.124617485795167,"d":"-10.1"},{"v":-10.048220755494414,"d":"-10.0"},{"v":-10.0367480637247,"d":"-10.0"},{"v":-9.993468459777546,"d":"-10.0"},{"v":-9.584350233854606,"d":"-9.6"}]
["1990-2011",{"v":-8.226020071221235,"d":"-8.2"},{"v":-8.226020071221235,"d":"-8.2"},{"v":-9.08980043039238,"d":"-9.1"},{"v":-9.316268673548642,"d":"-9.3"},{"v":-9.573911302305973,"d":"-9.6"},{"v":-9.482709700079322,"d":"-9.5"},{"v":-9.476260642234418,"d":"-9.5"},{"v":-9.661845006665228,"d":"-9.7"},{"v":-9.954176348065783,"d":"-10.0"},{"v":-10.296165061875373,"d":"-10.3"},{"v":-10.131931337163541,"d":"-10.1"},{"v":-9.938379656261828,"d":"-9.9"},{"v":-9.910152763861152,"d":"-9.9"},{"v":-9.87799089386817,"d":"-9.9"},{"v":-9.800221593117877,"d":"-9.8"},{"v":-9.602047935260819,"d":"-9.6"},{"v":-9.140708544349232,"d":"-9.1"}]
["1990-2012",{"v":-6.9930484337628185,"d":"-7.0"},{"v":-6.9930484337628185,"d":"-7.0"},{"v":-7.319924199666535,"d":"-7.3"},{"v":-8.401668496947288,"d":"-8.4"},{"v":-8.776931546108544,"d":"-8.8"},{"v":-8.936951002540845,"d":"-8.9"},{"v":-9.14913722995149,"d":"-9.1"},{"v":-9.323665321234104,"d":"-9.3"},{"v":-9.531880939536917,"d":"-9.5"},{"v":-9.6834218017572,"d":"-9.7"},{"v":-9.736023293612135,"d":"-9.7"},{"v":-9.707742681856388,"d":"-9.7"},{"v":-9.74193932038064,"d":"-9.7"},{"v":-9.691605842330617,"d":"-9.7"},{"v":-9.64197531014987,"d":"-9.6"},{"v":-9.872580778658264,"d":"-9.9"},{"v":-9.881169826377697,"d":"-9.9"},{"v":-9.922984250861344,"d":"-9.9"}]
["1990-2013",{"v":-7.0372096725807,"d":"-7.0"},{"v":-7.0372096725807,"d":"-7.0 "},{"v":-7.565023756890914,"d":"-7.6 "},{"v":-8.50035885717027,"d":"-8.5"},{"v":-8.798140049007388,"d":"-8.8"},{"v":-9.00548401310652,"d":"-9.0"},{"v":-9.24390260771975,"d":"-9.2"},{"v":-9.371730249235549,"d":"-9.4"},{"v":-9.602188003521611,"d":"-9.6"},{"v":-9.730448682888579,"d":"-9.7"},{"v":-9.842055980563565,"d":"-9.8"},{"v":-9.81936840702037,"d":"-9.8"},{"v":-9.869168036450132,"d":"-9.9"},{"v":-9.793737641585116,"d":"-9.8"},{"v":-9.739978703839677,"d":"-9.7"},{"v":-9.874872690242334,"d":"-9.9"},{"v":-9.904782674620977,"d":"-9.9"},{"v":-10.000876959177857,"d":"-10.0"},{"v":-9.990742367282557,"d":"-10.0"}]
["1990-2014",{"v":-8.762098656068758,"d":"-8.8"},{"v":-8.762098656068758,"d":"-8.8"},{"v":-9.487043755120654,"d":"-9.5"},{"v":-10.122873490846855,"d":"-10.1"},{"v":-10.397477611891594,"d":"-10.4"},{"v":-10.44755320615036,"d":"-10.4"},{"v":-10.509455674502329,"d":"-10.5"},{"v":-10.507529715381878,"d":"-10.5"},{"v":-10.570974900070045,"d":"-10.6"},{"v":-10.566861136704027,"d":"-10.6"},{"v":-10.513558960251043,"d":"-10.5"},{"v":-10.481775300621575,"d":"-10.5"},{"v":-10.540733856111894,"d":"-10.5"},{"v":-10.520637211237599,"d":"-10.5"},{"v":-10.53219173668322,"d":"-10.5"},{"v":-10.546814525453529,"d":"-10.5"},{"v":-10.459328058242157,"d":"-10.5"},{"v":-10.412639429060217,"d":"-10.4"},{"v":-10.28137890246488,"d":"-10.3"},{"v":-10.169959012543355,"d":"-10.2"}]
["1990-2015",{"v":-5.255431818016718,"d":"-5.3"},{"v":-5.255431818016718,"d":"-5.3"},{"v":-6.092670277419046,"d":"-6.1"},{"v":-6.733503617368034,"d":"-6.7"},{"v":-6.919116090480998,"d":"-6.9"},{"v":-7.115365900208888,"d":"-7.1"},{"v":-7.3979040915762155,"d":"-7.4"},{"v":-7.586621914827752,"d":"-7.6"},{"v":-7.514974519042777,"d":"-7.5"},{"v":-7.42609628858924,"d":"-7.4"},{"v":-7.459531148986156,"d":"-7.5"},{"v":-7.4323537090939045,"d":"-7.4"},{"v":-7.36634827226212,"d":"-7.4"},{"v":-7.652118180725226,"d":"-7.7"},{"v":-7.807288471201608,"d":"-7.8"},{"v":-7.4977421816779986,"d":"-7.5"},{"v":-7.004408723062717,"d":"-7.0"},{"v":-6.522481711822074,"d":"-6.5"},{"v":-7.166467089555789,"d":"-7.2"},{"v":-7.308211426208517,"d":"-7.3"},{"v":-6.973816427308646,"d":"-7.0"}]
["1990-2016",{"v":-7.8269278984457396,"d":"-7.8"},{"v":-7.8269278984457396,"d":"-7.8"},{"v":-9.984140742597793,"d":"-10.0"},{"v":-10.949606767425442,"d":"-10.9"},{"v":-11.451295227029238,"d":"-11.5"},{"v":-11.875164716989024,"d":"-11.9"},{"v":-11.782462963768012,"d":"-11.8"},{"v":-12.057938573753663,"d":"-12.1"},{"v":-12.634611065552427,"d":"-12.6"},{"v":-12.701358604571114,"d":"-12.7"},{"v":-12.602640330393578,"d":"-12.6"},{"v":-12.697748913928269,"d":"-12.7"},{"v":-13.110838689011787,"d":"-13.1"},{"v":-12.421263906209424,"d":"-12.4"},{"v":-12.731542880770373,"d":"-12.7"},{"v":-13.69467725367695,"d":"-13.7"},{"v":-13.466368436664967,"d":"-13.5"},{"v":-11.319941402757586,"d":"-11.3"},{"v":-12.389633959256683,"d":"-12.4"},{"v":-12.696569024505445,"d":"-12.7"},{"v":-12.890693340285708,"d":"-12.9"},{"v":-12.663350415976959,"d":"-12.7"}]

{"sheet":"Chart D5 data","index":48,"n_rows":29,"n_cols":13,"rows_kept":29,"merged":[[0,0,0,12],[14,0,14,12]]}
["Year-on-year changes to the Baseline since the 1990-2008 inventory, by source sector.  Values in MtCO2e"]
[]
[null,"1990-2008 inventory","1990-2016 inventory","Change from 1990-2008 to 1990-2016","1990-2009","1990-2010","1990-2011","1990-2012","1990-2013","1990-2014","1990-2015","1990-2016","% Change from 1990-2008 to 1990-2016"]
["Total",{"v":70.20120874203604,"d":"70.2"},{"v":75.68784905878555,"d":"75.7"},{"$f":"SUM(E4:K4)","v":{"v":6.889359705846568,"d":"6.9"}},{"v":1.553433916563506,"d":"1.6"},{"v":0.5210908613941854,"d":"0.5"},{"v":0.6985245336345542,"d":"0.7"},{"v":2.6150793725392276,"d":"2.6"},{"v":5.19682680780805,"d":"5.2"},{"$f":"SUM(J5:J13)","v":{"v":-3.5288094156615757,"d":"-3.5"}},{"v":-0.16678637043138167,"d":"-0.2"},{"$f":"(B20)","v":{"v":-1.4027193890970864,"d":"-1.4"}},{"$f":"D4/B4","v":{"v":0.09813733736640438,"d":"9.8%"}}]
["Waste Management",{"v":5.777833844220619,"d":"5.8"},{"v":6.028898948641075,"d":"6.0"},{"$f":"SUM(E5:K5)","v":{"v":-0.15216364068158672,"d":"-0.2"}},{"v":0.6981535434918174,"d":"0.7"},{"v":0.09572800663004255,"d":"0.1"},{"v":0.14057535781822317,"d":"0.1"},{"v":-0.016428389471375482,"d":"-0.0"},{"v":3.1665734804829446,"d":"3.2"},{"v":-0.027333648875194072,"d":"-0.0"},{"v":-4.209431990758045,"d":"-4.2"},{"$f":"(B24)","v":{"v":0.40322874510204265,"d":"0.4"}},{"$f":"D5/B5","v":{"v":-0.02633575917621638,"d":"-2.6%"}}]
["Business and Industrial Process",{"v":12.399391047209336,"d":"12.4"},{"v":14.432721492883406,"d":"14.4"},{"v":1.997533827435868,"d":"2.0"},{"v":0.01861031571790228,"d":"0.0"},{"v":0.7886754161715768,"d":"0.8"},{"v":0.4288415778108199,"d":"0.4"},{"v":-0.035720894256249025,"d":"-0.0"},{"v":0.7555353076045037,"d":"0.8"},{"v":-0.00784728999393458,"d":"-0.0"},{"v":0.049439394381249,"d":"0.0"},{"$f":"(B25)","v":{"v":0.03579661823820146,"d":"0.0"}},{"v":0.16109934913984683,"d":"16.1%"}]
["Energy Supply",{"v":22.34657789146354,"d":"22.3"},{"v":22.73372767912457,"d":"22.7"},{"v":0.39971112619171834,"d":"0.4"},{"v":-0.1078091170812776,"d":"-0.1"},{"v":0.0840800497773273,"d":"0.1"},{"v":0.08361491252324527,"d":"0.1"},{"v":-0.007931223012860755,"d":"-0.0"},{"v":0.3305578595594092,"d":"0.3"},{"v":0.044814820532288024,"d":"0.0"},{"v":-0.027616176106413093,"d":"-0.0"},{"$f":"(B28)","v":{"v":0,"d":"0.0"}},{"v":0.01788690546414309,"d":"1.8%"}]
["Agriculture and Related Land Use",{"v":13.82678872153848,"d":"13.8"},{"v":13.917607138493755,"d":"13.9"},{"v":0.7454038226067468,"d":"0.7"},{"v":0.6786351201726379,"d":"0.7"},{"v":-0.24412618323126267,"d":"-0.2"},{"v":0.0828453414079231,"d":"0.1"},{"v":0.895791261081845,"d":"0.9"},{"v":0.8740714987708031,"d":"0.9"},{"v":-1.8793117464008482,"d":"-1.9"},{"v":0.3374985308056484,"d":"0.3"},{"$f":"(B21)","v":{"v":-0.6545854056514706,"d":"-0.7"}},{"v":0.05391011880044169,"d":"5.4%"}]
["Public Sector Buildings",{"v":1.2755101338710124,"d":"1.3"},{"v":1.6886004539593495,"d":"1.7"},{"v":0.40709617787316255,"d":"0.4"},{"v":0.05465147041884877,"d":"0.1"},{"v":-0.10416788226379503,"d":"-0.1"},{"v":-4.249375494305152E-4,"d":"-0.0"},{"v":0.4373409046849026,"d":"0.4"},{"v":0.0211686883235489,"d":"0.0"},{"v":-0.001272779660749901,"d":"-0.0"},{"v":-1.9928608016228644E-4,"d":"-0.0"},{"$f":"(B26)","v":{"v":0.005994142215171694,"d":"0.0"}},{"v":0.31916342102095024,"d":"31.9%"}]
["Residential",{"v":7.788516298586483,"d":"7.8"},{"v":8.060449787785258,"d":"8.1"},{"v":0.3456792399215285,"d":"0.3"},{"v":0.3915308043718486,"d":"0.4"},{"v":4.3867508450468051E-4,"d":"0.0"},{"v":2.7529308541751618E-4,"d":"0.0"},{"v":0.006901008046884982,"d":"0.0"},{"v":-0.14141957036019726,"d":"-0.1"},{"v":-0.03833597325079552,"d":"-0.0"},{"v":0.12628900294386547,"d":"0.1"},{"$f":"(B23)","v":{"v":-0.07374575072275391,"d":"-0.1"}},{"v":0.04438319529282681,"d":"4.4%"}]
["Development",{"v":1.776595236241248,"d":"1.8"},{"v":1.8915056233148553,"d":"1.9"},{"v":0.11585337462229761,"d":"0.1"},{"v":0.01004377144484736,"d":"0.0"},{"v":-6.5681786566387235E-3,"d":"-0.0"},{"v":-0.03142462461577922,"d":"-0.0"},{"v":-0.009159337151607883,"d":"-0.0"},{"v":0.08926610403500113,"d":"0.1"},{"v":0.015095022405752445,"d":"0.0"},{"v":0.048600617160722503,"d":"0.0"},{"$f":"(B27)","v":{"v":-9.4298754869037715E-4,"d":"-0.0"}},{"v":0.06521090018647648,"d":"6.5%"}]
["Transport (including International Aviation and Shipping)",{"v":13.302906419656587,"d":"13.3"},{"v":14.761265833029025,"d":"14.8"},{"v":-0.007233254857704541,"d":"-0.0"},{"v":-0.21140101283878243,"d":"-0.2"},{"v":-0.060278267490067705,"d":"-0.1"},{"v":-0.08434092013771455,"d":"-0.1"},{"v":0.11131440515926894,"d":"0.1"},{"v":0.1452346782099223,"d":"0.1"},{"v":0.09027116306996419,"d":"0.1"},{"v":0.001966699169704711,"d":"0.0"},{"$f":"(B29)","v":{"v":0,"d":"0.0"}},{"v":-5.4373492750550874E-4,"d":"-0.1%"}]
["Forestry",{"v":-8.292910850751227,"d":"-8.3"},{"v":-7.8269278984457396,"d":"-7.8"},{"v":3.0374790327345083,"d":"3.0"},{"v":0.021019020865628235,"d":"0.0"},{"v":-0.032690774627495145,"d":"-0.0"},{"v":0.07856253329185847,"d":"0.1"},{"v":1.2329716374584168,"d":"1.2"},{"v":-0.04416123881788181,"d":"-0.0"},{"v":-1.724888983488058,"d":"-1.7"},{"v":3.50666683805204,"d":"3.5"},{"$f":"(B22)","v":{"v":-2.5714960804290214,"d":"-2.6"}},{"v":-0.3662741692754786,"d":"-36.6%"}]
[]
["Unlike for other source sectors, downwards revisions to net emissions from forestry are presented as a positive percentage change.    This is because forestry causes a net removal of emissions.  This means that an downwards revision from forestry will cause a positive percentage change in the quantity of emissions removed."]
[]
[]
[]
[null,"Change between 1990-2015 and 1990-2016"]
["TOTAL",{"$f":"'Chart D2 data '!D4","v":{"v":-1.4027193890970864,"d":"-1.40"}}]
["Agriculture and Related Land Use",{"$f":"'Chart D2 data '!D5","v":{"v":-0.6545854056514706,"d":"-0.65"}}]
["Forestry",{"$f":"'Chart D2 data '!D6","v":{"v":-2.5714960804290214,"d":"-2.57"}}]
["Residential",{"$f":"'Chart D2 data '!D7","v":{"v":-0.07374575072275391,"d":"-0.07"}}]
["Waste Management",{"$f":"'Chart D2 data '!D8","v":{"v":0.40322874510204265,"d":"0.40"}}]
["Business and Industrial Process",{"$f":"'Chart D2 data '!D9","v":{"v":0.03579661823820146,"d":"0.04"}}]
["Public Sector Buildings",{"$f":"'Chart D2 data '!D10","v":{"v":0.005994142215171694,"d":"0.01"}}]
["Development",{"$f":"'Chart D2 data '!D11","v":{"v":-9.4298754869037715E-4,"d":"-0.00"}}]
["Energy Supply",{"$f":"'Chart D2 data '!D12","v":{"v":0,"d":"0.00"}}]
["Transport (including International Aviation and Shipping)",{"$f":"'Chart D2 data '!D13","v":{"v":0,"d":"0.00"}}]